{"text_format":"1","workbook":"xlsx","n_sheets":6,"sheets":["【準備】登録","【準備】対戦カード","【結果】個人成績表","【進行】結果入力表","【結果】リーグ成績表","【結果】総合結果表"],"not_rendered":{"charts":0,"images":0,"macros":0,"external_links":0,"defined_names":7,"comments":2,"pivot_tables":0},"unopened":[],"bounds":{"document_bytes":16777216,"sheet_cells":100000,"rows_first":2000,"rows_last":500,"rows_between":2000,"halvings":0,"cell_chars":16384,"cell_head_chars":4096},"cells_cut":0,"cells_raw":0,"read":"whole","date_system":"1900"}

{"sheet":"【準備】登録","index":0,"n_rows":284,"n_cols":73,"rows_kept":284,"cut":false,"hidden":false,"merged":[[32,3,32,5],[32,6,32,9],[32,10,32,12],[32,13,32,16],[32,17,32,19],[32,20,32,23],[30,3,30,5],[30,6,30,9],[30,10,30,12],[30,13,30,16],[30,17,30,19],[30,20,30,23],[31,3,31,5],[31,6,31,9],[31,10,31,12],[31,13,31,16],[31,17,31,19],[31,20,31,23],[27,17,27,19],[27,20,27,23],[26,17,26,19],[26,20,26,23],[27,3,27,5],[27,6,27,9],[27,10,27,12],[27,13,27,16],[28,17,28,19],[28,20,28,23],[28,3,28,5],[28,6,28,9],[28,10,28,12],[28,13,28,16],[26,13,26,16],[25,3,25,5],[25,6,25,9],[21,3,21,5],[21,17,21,19],[21,20,21,23],[22,3,22,5],[22,6,22,9],[23,10,23,12],[23,13,23,16],[25,17,25,19],[25,20,25,23],[24,20,24,23],[23,20,23,23],[24,13,24,16],[23,17,23,19],[20,17,20,23],[22,10,22,12],[21,6,21,9],[21,10,21,12],[21,13,21,16],[22,17,22,19],[20,10,20,16],[22,20,22,23],[12,24,12,25],[12,12,12,13],[12,21,12,22],[11,9,11,10],[8,24,8,26],[9,24,9,25],[11,18,11,19],[11,21,11,22],[12,18,12,19],[10,24,10,25],[11,24,11,25],[9,21,9,22],[8,18,8,20],[9,18,9,19],[8,15,8,17],[9,12,9,13],[11,12,11,13],[11,15,11,16],[9,15,9,16],[10,12,10,13],[10,15,10,16],[10,9,10,10],[8,21,8,23],[12,15,12,16],[10,18,10,19],[10,21,10,22],[25,13,25,16],[1,6,1,7],[8,9,8,11],[5,10,5,11],[9,9,9,10],[8,12,8,14],[10,1,10,2],[10,6,10,7],[3,3,3,6],[8,1,9,2],[9,6,9,7],[5,3,5,8],[10,3,10,4],[12,1,12,2],[11,3,11,4],[12,3,12,4],[11,1,11,2],[9,3,9,4],[11,6,11,7],[15,3,15,4],[24,17,24,19],[22,13,22,16],[26,3,26,5],[26,6,26,9],[25,10,25,12],[20,3,20,9],[26,10,26,12],[8,3,8,5],[8,6,8,8],[14,3,14,4],[12,6,12,7],[12,9,12,10],[23,3,23,5],[23,6,23,9],[24,3,24,5],[24,6,24,9],[24,10,24,12]]}
[]
["対抗戦名称",null,null,"第",9,"回","神奈滋",null,"対抗戦"]
[]
["開催日",null,null,"2021-03-21",null,null,null,null,null,null,null,null,null,null,null,null,null,null,null,null,null,null,null,null,null,null,null,null,null,null,null,null,null,null,"選手ID","チーム","選手名","持点"]
[null,null,null,null,null,null,null,null,null,null,null,null,null,null,null,null,null,null,null,null,null,null,null,null,null,null,null,null,null,null,null,null,null,null,11,{"$f":"$B$13","v":"NRC"},{"$f":"D13","v":"岩本　剛"},{"$f":"F13","v":180}]
["会場",null,null,"キングスポット",null,null,null,null,null,"（","奈良",null,"）",null,null,null,null,3,"クラブ",null,6,"名対抗",null,null,null,null,null,null,null,null,null,null,null,null,12,{"$f":"$B$13","v":"NRC"},{"$f":"G13","v":"吉向　翔平"},{"$f":"I13","v":180}]
[null,null,null,null,null,null,null,null,null,null,null,null,null,null,null,null,null,null,null,null,null,null,null,null,null,null,null,null,null,null,null,null,null,null,13,"NRC",{"$f":"J13","v":"金澤　茂昌"},{"$f":"L13","v":180}]
["出場選手",null,null,null,null,null,null,null,null,null,null,null,null,null,null,null,null,null,null,null,null,null,null,null,null,null,null,null,null,null,null,null,null,null,14,"NRC",{"$f":"M13","v":"植田　慎也"},{"$f":"O13","v":180}]
["前回","チーム",null,1,null,null,2,null,null,3,null,null,4,null,null,5,null,null,6,null,null,7,null,null,8,null,null,null,null,null,null,null,null,null,15,"NRC",{"$f":"P13","v":"長谷川　進"},{"$f":"R13","v":180}]
["順位",null,null,"選手名",null,"点数","選手名",null,"点数","選手名",null,"点数","選手名",null,"点数","選手名",null,"点数","選手名",null,"点数","選手名",null,"点数","選手名",null,"点数",null,null,null,null,null,null,null,16,"NRC",{"$f":"S13","v":"宮野　早織"},{"$f":"U13","v":140}]
[3,"SBC",null,"林　秀忠",null,180,"秋田　倫央",null,180,"大橋　正寛",null,180,"大橋　義治",null,180,"山中　康寛",null,180,"大橋　洋子",null,140,null,null,null,null,null,null,null,null,null,null,null,null,null,17,"NRC",{"$f":"V13","v":0},{"$f":"X13","v":0}]
[2,"HRC",null,"高木　俊行",null,180,"金井　健太郎",null,180,"平井　洸志",null,180,"中尾　亮太",null,180,"宮本　一",null,180,"河地　恵里",null,140,null,null,null,null,null,null,null,null,null,null,null,null,null,18,"NRC",{"$f":"Y13","v":0},{"$f":"AA13","v":0}]
[1,"NRC",null,"岩本　剛",null,180,"吉向　翔平",null,180,"金澤　茂昌",null,180,"植田　慎也",null,180,"長谷川　進",null,180,"宮野　早織",null,140,null,null,null,null,null,null,null,null,null,null,null,null,null,21,{"$f":"$B$12","v":"HRC"},{"$f":"D12","v":"高木　俊行"},{"$f":"F12","v":180}]
[null,null,null,null,null,null,null,null,null,null,null,null,null,null,null,null,null,null,null,null,null,null,null,null,null,null,null,null,null,null,null,null,null,null,22,{"$f":"$B$12","v":"HRC"},{"$f":"G12","v":"金井　健太郎"},{"$f":"I12","v":180}]
["点数",null,null,"男性",null,"：","M",null,180,"点",null,null,null,null,null,null,null,null,null,null,null,null,null,null,null,null,null,null,null,null,null,null,null,null,23,"HRC",{"$f":"J12","v":"平井　洸志"},{"$f":"L12","v":180}]
[null,null,null,"女性",null,"：","W",null,140,"点",null,null,null,null,null,null,null,null,null,null,null,null,null,null,null,null,null,null,null,null,null,null,null,null,24,"HRC",{"$f":"M12","v":"中尾　亮太"},{"$f":"O12","v":180}]
[null,null,null,null,null,null,null,null,null,null,null,null,null,null,null,null,null,null,null,null,null,null,null,null,null,null,null,null,null,null,null,null,null,null,25,"HRC",{"$f":"P12","v":"宮本　一"},{"$f":"R12","v":180}]
[null,null,null,null,null,null,null,null,null,null,null,null,null,null,null,null,null,null,null,null,null,null,null,null,null,null,null,null,null,null,null,null,null,null,26,"HRC",{"$f":"S12","v":"河地　恵里"},{"$f":"U12","v":140}]
[null,null,null,null,null,null,null,null,null,null,null,null,null,null,null,null,null,null,null,null,null,null,null,null,null,null,null,null,null,null,null,null,null,null,27,"HRC",{"$f":"V12","v":0},{"$f":"X12","v":0}]
[null,null,null,null,null,null,null,null,null,null,null,null,null,null,null,null,null,null,null,null,null,null,null,null,null,null,null,null,null,null,null,null,null,null,28,"HRC",{"$f":"Y12","v":0},{"$f":"AA12","v":0}]
[null,null,null,"NRC",null,null,null,null,null,null,"HRC",null,null,null,null,null,null,"SBC",null,null,null,null,null,null,null,null,null,null,null,null,null,null,null,null,31,{"$f":"$B$11","v":"SBC"},{"$f":"D11","v":"林　秀忠"},{"$f":"F11","v":180}]
[null,null,1,null,null,null,null,null,null,null,null,null,null,null,null,null,null,null,null,null,null,null,null,null,null,null,null,null,null,null,null,null,null,null,32,{"$f":"$B$11","v":"SBC"},{"$f":"G11","v":"秋田　倫央"},{"$f":"I11","v":180}]
[null,null,2,null,null,null,null,null,null,null,null,null,null,null,null,null,null,null,null,null,null,null,null,null,null,null,null,null,null,null,null,null,null,null,33,"SBC",{"$f":"J11","v":"大橋　正寛"},{"$f":"L11","v":180}]
[null,null,3,null,null,null,null,null,null,null,null,null,null,null,null,null,null,null,null,null,null,null,null,null,null,null,null,null,null,null,null,null,null,null,34,"SBC",{"$f":"M11","v":"大橋　義治"},{"$f":"O11","v":180}]
[null,null,4,null,null,null,null,null,null,null,null,null,null,null,null,null,null,null,null,null,null,null,null,null,null,null,null,null,null,null,null,null,null,null,35,"SBC",{"$f":"P11","v":"山中　康寛"},{"$f":"R11","v":180}]
[null,null,5,null,null,null,null,null,null,null,null,null,null,null,null,null,null,null,null,null,null,null,null,null,null,null,null,null,null,null,null,null,null,null,36,"SBC",{"$f":"S11","v":"大橋　洋子"},{"$f":"U11","v":140}]
[null,null,6,null,null,null,null,null,null,null,null,null,null,null,null,null,null,null,null,null,null,null,null,null,null,null,null,null,null,null,null,null,null,null,37,"SBC",{"$f":"V11","v":0},{"$f":"X11","v":0}]
[null,null,7,null,null,null,null,null,null,null,null,null,null,null,null,null,null,null,null,null,null,null,null,null,null,null,null,null,null,null,null,null,null,null,38,"SBC",{"$f":"Y11","v":0},{"$f":"AA11","v":0}]
[null,null,8]
[]
[null,null,"補1"]
[null,null,"補2"]
[null,null,"補3"]
[]
[null,null,"運営"]
[]
[]
[]
[]
[]
[]
[]
[null,null,null,null,null,null,null,null,null,null,null,null,null,null,null,null,null,null,null,null,null,null,null,null,null,null,null,null,null,null,null,null,null,"クラブID","クラブ名"]
[null,null,null,null,null,null,null,null,null,null,null,null,null,null,null,null,null,null,null,null,null,null,null,null,null,null,null,null,null,null,null,null,null,1,{"$f":"B13","v":"NRC"}]
[null,null,null,null,null,null,null,null,null,null,null,null,null,null,null,null,null,null,null,null,null,null,null,null,null,null,null,null,null,null,null,null,null,2,{"$f":"B12","v":"HRC"},null,null,null,null,null,null,null,null,null,null,null,null,null,null,null,null,null,2,null,3]
[null,null,null,null,null,null,null,null,null,null,null,null,null,null,null,null,null,null,null,null,null,null,null,null,null,null,null,null,null,null,null,null,null,3,{"$f":"B11","v":"SBC"},null,null,null,null,null,null,null,null,null,null,null,null,null,null,null,null,null,1,null,3]
[null,null,null,null,null,null,null,null,null,null,null,null,null,null,null,null,null,null,null,null,null,null,null,null,null,null,null,null,null,null,null,null,null,null,null,null,null,null,null,null,null,null,null,null,null,null,null,null,null,null,null,null,1,null,2]
[]
[null,null,null,null,null,null,null,null,null,null,null,null,null,null,null,null,null,null,null,null,null,null,null,null,null,null,null,null,null,null,null,null,{"$f":"U6","v":6},"M",{"$f":"AG49&AH49","v":"6M"},null,null,null,null,null,null,null,null,null,null,null,null,null,null,5,"M",null,null,null,null,6,"M",null,null,null,null,7,"M",null,null,null,null,8,"M"]
[null,null,null,null,null,null,null,null,null,null,null,null,null,null,null,null,null,null,null,null,null,null,null,null,null,null,null,null,null,null,"節","G-No","T","n","C","p","N","N","p","C","T","n",null,null,null,null,null,null,"節"]
[null,null,null,null,null,null,null,null,null,null,null,null,null,null,null,null,null,null,null,null,null,null,null,null,null,null,null,null,null,null,{"$f":"VLOOKUP($AI$49&AF51,$AR$51:$AW$1166,6,FALSE)","v":1},1,{"$f":"VLOOKUP($AI$49&AF51,$AR$51:$AW$1166,2,FALSE)","v":2},{"$f":"VLOOKUP($AI$49&AF51,$AR$51:$AW$1166,3,FALSE)","v":1},{"$f":"VLOOKUP(AG51,$AH$44:$AI$46,2,FALSE)","v":"HRC"},{"$f":"VLOOKUP(VALUE(AG51&AH51),$AI$5:$AL$28,4,FALSE)","v":180},{"$f":"VLOOKUP(VALUE(AG51&AH51),$AI$5:$AL$28,3,FALSE)","v":"高木　俊行"},{"$f":"VLOOKUP(VALUE(AO51&AP51),$AI$5:$AL$28,3,FALSE)","v":"林　秀忠"},{"$f":"VLOOKUP(VALUE(AO51&AP51),$AI$5:$AL$28,4,FALSE)","v":180},{"$f":"VLOOKUP(AO51,$AH$44:$AI$46,2,FALSE)","v":"SBC"},{"$f":"VLOOKUP($AI$49&AF51,$AR$51:$AW$1166,4,FALSE)","v":3},{"$f":"VLOOKUP($AI$49&AF51,$AR$51:$AW$1166,5,FALSE)","v":1},null,"5M1",2,1,3,1,1,1,{"$f":"$AX$49&$AY$49&AX51","v":"5M1"},2,1,3,1,1,{"$f":"$BD$49&$BE$49&BD51","v":"6M1"},2,1,3,1,1,{"$f":"$BJ$49&$BK$49&BJ51","v":"7M1"},2,1,3,1,1,{"$f":"$BP$49&$BQ$49&BP51","v":"8M1"},2,1,3,1]
[null,null,null,null,null,null,null,null,null,null,null,null,null,null,null,null,null,null,null,null,null,null,null,null,null,null,null,null,null,null,{"$f":"VLOOKUP($AI$49&AF52,$AR$51:$AW$1166,6,FALSE)","v":1},2,{"$f":"VLOOKUP($AI$49&AF52,$AR$51:$AW$1166,2,FALSE)","v":2},{"$f":"VLOOKUP($AI$49&AF52,$AR$51:$AW$1166,3,FALSE)","v":2},{"$f":"VLOOKUP(AG52,$AH$44:$AI$46,2,FALSE)","v":"HRC"},180,"金井　健太郎","秋田　倫央",180,{"$f":"VLOOKUP(AO52,$AH$44:$AI$46,2,FALSE)","v":"SBC"},{"$f":"VLOOKUP($AI$49&AF52,$AR$51:$AW$1166,4,FALSE)","v":3},{"$f":"VLOOKUP($AI$49&AF52,$AR$51:$AW$1166,5,FALSE)","v":2},null,"5M2",2,2,3,2,1,2,{"$f":"$AX$49&$AY$49&AX52","v":"5M2"},2,2,3,2,2,{"$f":"$BD$49&$BE$49&BD52","v":"6M2"},2,2,3,2,2,{"$f":"$BJ$49&$BK$49&BJ52","v":"7M2"},2,2,3,2,2,{"$f":"$BP$49&$BQ$49&BP52","v":"8M2"},2,2,3,2]
[null,null,null,null,null,null,null,null,null,null,null,null,null,null,null,null,null,null,null,null,null,null,null,null,null,null,null,null,null,null,1,3,2,3,"HRC",180,"平井　洸志","大橋　正寛",180,"SBC",3,3,null,"5M3",2,3,3,3,1,3,"5M3",2,3,3,3,3,"6M3",2,3,3,3,3,"7M3",2,3,3,3,3,"8M3",2,3,3,3]
[null,null,null,null,null,null,null,null,null,null,null,null,null,null,null,null,null,null,null,null,null,null,null,null,null,null,null,null,null,null,1,4,2,4,"HRC",180,"中尾　亮太","大橋　義治",180,"SBC",3,4,null,"5M4",2,4,3,4,1,4,"5M4",2,4,3,4,4,"6M4",2,4,3,4,4,"7M4",2,4,3,4,4,"8M4",2,4,3,4]
[null,null,null,null,null,null,null,null,null,null,null,null,null,null,null,null,null,null,null,null,null,null,null,null,null,null,null,null,null,null,1,5,2,5,"HRC",180,"宮本　一","山中　康寛",180,"SBC",3,5,null,"5M5",2,5,3,5,1,5,"5M5",2,5,3,5,5,"6M5",2,5,3,5,5,"7M5",2,5,3,5,5,"8M5",2,5,3,5]
[null,null,null,null,null,null,null,null,null,null,null,null,null,null,null,null,null,null,null,null,null,null,null,null,null,null,null,null,null,null,1,6,2,6,"HRC",140,"河地　恵里","大橋　洋子",140,"SBC",3,6,null,"5M6",1,1,3,1,1,6,"5M6",1,1,3,1,6,"6M6",2,6,3,6,6,"7M6",2,6,3,6,6,"8M6",2,6,3,6]
[null,null,null,null,null,null,null,null,null,null,null,null,null,null,null,null,null,null,null,null,null,null,null,null,null,null,null,null,null,null,1,7,1,1,"NRC",180,"岩本　剛","林　秀忠",180,"SBC",3,1,null,"5M7",1,2,3,2,1,7,"5M7",1,2,3,2,7,"6M7",1,1,3,1,7,"7M7",2,7,3,7,7,"8M7",2,7,3,7]
[null,null,null,null,null,null,null,null,null,null,null,null,null,null,null,null,null,null,null,null,null,null,null,null,null,null,null,null,null,null,1,8,1,2,"NRC",180,"吉向　翔平","秋田　倫央",180,"SBC",3,2,null,"5M8",1,3,3,3,1,8,"5M8",1,3,3,3,8,"6M8",1,2,3,2,8,"7M8",1,1,3,1,8,"8M8",2,8,3,8]
[null,null,null,null,null,null,null,null,null,null,null,null,null,null,null,null,null,null,null,null,null,null,null,null,null,null,null,null,null,null,1,9,1,3,"NRC",180,"金澤　茂昌","大橋　正寛",180,"SBC",3,3,null,"5M9",1,4,3,4,1,9,"5M9",1,4,3,4,9,"6M9",1,3,3,3,9,"7M9",1,2,3,2,9,"8M9",1,1,3,1]
[null,null,null,null,null,null,null,null,null,null,null,null,null,null,null,null,null,null,null,null,null,null,null,null,null,null,null,null,null,null,1,10,1,4,"NRC",180,"植田　慎也","大橋　義治",180,"SBC",3,4,null,"5M10",1,5,3,5,1,10,"5M10",1,5,3,5,10,"6M10",1,4,3,4,10,"7M10",1,3,3,3,10,"8M10",1,2,3,2]
[null,null,null,null,null,null,null,null,null,null,null,null,null,null,null,null,null,null,null,null,null,null,null,null,null,null,null,null,null,null,1,11,1,5,"NRC",180,"長谷川　進","山中　康寛",180,"SBC",3,5,null,"5M11",1,1,2,1,1,11,"5M11",1,1,2,1,11,"6M11",1,5,3,5,11,"7M11",1,4,3,4,11,"8M11",1,3,3,3]
[null,null,null,null,null,null,null,null,null,null,null,null,null,null,null,null,null,null,null,null,null,null,null,null,null,null,null,null,null,null,1,12,1,6,"NRC",140,"宮野　早織","大橋　洋子",140,"SBC",3,6,null,"5M12",1,2,2,2,1,12,"5M12",1,2,2,2,12,"6M12",1,6,3,6,12,"7M12",1,5,3,5,12,"8M12",1,4,3,4]
[null,null,null,null,null,null,null,null,null,null,null,null,null,null,null,null,null,null,null,null,null,null,null,null,null,null,null,null,null,null,1,13,1,1,"NRC",180,"岩本　剛","高木　俊行",180,"HRC",2,1,null,"5M13",1,3,2,3,1,13,"5M13",1,3,2,3,13,"6M13",1,1,2,1,13,"7M13",1,6,3,6,13,"8M13",1,5,3,5]
[null,null,null,null,null,null,null,null,null,null,null,null,null,null,null,null,null,null,null,null,null,null,null,null,null,null,null,null,null,null,1,14,1,2,"NRC",180,"吉向　翔平","金井　健太郎",180,"HRC",2,2,null,"5M14",1,4,2,4,1,14,"5M14",1,4,2,4,14,"6M14",1,2,2,2,14,"7M14",1,7,3,7,14,"8M14",1,6,3,6]
[null,null,null,null,null,null,null,null,null,null,null,null,null,null,null,null,null,null,null,null,null,null,null,null,null,null,null,null,null,null,1,15,1,3,"NRC",180,"金澤　茂昌","平井　洸志",180,"HRC",2,3,null,"5M15",1,5,2,5,1,15,"5M15",1,5,2,5,15,"6M15",1,3,2,3,15,"7M15",1,1,2,1,15,"8M15",1,7,3,7]
[null,null,null,null,null,null,null,null,null,null,null,null,null,null,null,null,null,null,null,null,null,null,null,null,null,null,null,null,null,null,1,16,1,4,"NRC",180,"植田　慎也","中尾　亮太",180,"HRC",2,4,null,"5M16",2,2,3,3,2,16,"5M16",2,2,3,3,16,"6M16",1,4,2,4,16,"7M16",1,2,2,2,16,"8M16",1,8,3,8]
[null,null,null,null,null,null,null,null,null,null,null,null,null,null,null,null,null,null,null,null,null,null,null,null,null,null,null,null,null,null,1,17,1,5,"NRC",180,"長谷川　進","宮本　一",180,"HRC",2,5,null,"5M17",2,3,3,4,2,17,"5M17",2,3,3,4,17,"6M17",1,5,2,5,17,"7M17",1,3,2,3,17,"8M17",1,1,2,1]
[null,null,null,null,null,null,null,null,null,null,null,null,null,null,null,null,null,null,null,null,null,null,null,null,null,null,null,null,null,null,1,18,1,6,"NRC",140,"宮野　早織","河地　恵里",140,"HRC",2,6,null,"5M18",2,4,3,5,2,18,"5M18",2,4,3,5,18,"6M18",1,6,2,6,18,"7M18",1,4,2,4,18,"8M18",1,2,2,2]
[null,null,null,null,null,null,null,null,null,null,null,null,null,null,null,null,null,null,null,null,null,null,null,null,null,null,null,null,null,null,2,19,2,2,"HRC",180,"金井　健太郎","大橋　正寛",180,"SBC",3,3,null,"5M19",2,5,3,1,2,19,"5M19",2,5,3,1,19,"6M19",2,2,3,3,19,"7M19",1,5,2,5,19,"8M19",1,3,2,3]
[null,null,null,null,null,null,null,null,null,null,null,null,null,null,null,null,null,null,null,null,null,null,null,null,null,null,null,null,null,null,2,20,2,{"$f":"VLOOKUP($AI$49&AF70,$AR$51:$AW$1166,3,FALSE)","v":3},{"$f":"VLOOKUP(AG70,$AH$44:$AI$46,2,FALSE)","v":"HRC"},180,"平井　洸志","大橋　義治",180,"SBC",{"$f":"VLOOKUP($AI$49&AF70,$AR$51:$AW$1166,4,FALSE)","v":3},{"$f":"VLOOKUP($AI$49&AF70,$AR$51:$AW$1166,5,FALSE)","v":4},null,"5M20",2,1,3,2,2,20,"5M20",2,1,3,2,20,"6M20",2,3,3,4,20,"7M20",1,6,2,6,20,"8M20",1,4,2,4]
[null,null,null,null,null,null,null,null,null,null,null,null,null,null,null,null,null,null,null,null,null,null,null,null,null,null,null,null,null,null,2,21,2,4,"HRC",180,"中尾　亮太","山中　康寛",180,"SBC",3,5,null,"5M21",1,1,3,3,2,21,"5M21",1,1,3,3,21,"6M21",2,4,3,5,21,"7M21",1,7,2,7,21,"8M21",1,5,2,5]
[null,null,null,null,null,null,null,null,null,null,null,null,null,null,null,null,null,null,null,null,null,null,null,null,null,null,null,null,null,null,2,22,2,5,"HRC",180,"宮本　一","大橋　洋子",140,"SBC",3,6,null,"5M22",1,2,3,4,2,22,"5M22",1,2,3,4,22,"6M22",2,5,3,6,22,"7M22",2,2,3,3,22,"8M22",1,6,2,6]
[null,null,null,null,null,null,null,null,null,null,null,null,null,null,null,null,null,null,null,null,null,null,null,null,null,null,null,null,null,null,2,23,2,6,"HRC",140,"河地　恵里","林　秀忠",180,"SBC",3,1,null,"5M23",1,3,3,5,2,23,"5M23",1,3,3,5,23,"6M23",2,6,3,1,23,"7M23",2,3,3,4,23,"8M23",1,7,2,7]
[null,null,null,null,null,null,null,null,null,null,null,null,null,null,null,null,null,null,null,null,null,null,null,null,null,null,null,null,null,null,2,24,2,1,"HRC",180,"高木　俊行","秋田　倫央",180,"SBC",3,2,null,"5M24",1,4,3,1,2,24,"5M24",1,4,3,1,24,"6M24",2,1,3,2,24,"7M24",2,4,3,5,24,"8M24",1,8,2,8]
[null,null,null,null,null,null,null,null,null,null,null,null,null,null,null,null,null,null,null,null,null,null,null,null,null,null,null,null,null,null,2,25,1,1,"NRC",180,"岩本　剛","大橋　正寛",180,"SBC",3,3,null,"5M25",1,5,3,2,2,25,"5M25",1,5,3,2,25,"6M25",1,1,3,3,25,"7M25",2,5,3,6,25,"8M25",2,2,3,3]
[null,null,null,null,null,null,null,null,null,null,null,null,null,null,null,null,null,null,null,null,null,null,null,null,null,null,null,null,null,null,2,26,1,2,"NRC",180,"吉向　翔平","大橋　義治",180,"SBC",3,4,null,"5M26",1,1,2,2,2,26,"5M26",1,1,2,2,26,"6M26",1,2,3,4,26,"7M26",2,6,3,7,26,"8M26",2,3,3,4]
[null,null,null,null,null,null,null,null,null,null,null,null,null,null,null,null,null,null,null,null,null,null,null,null,null,null,null,null,null,null,2,27,1,3,"NRC",180,"金澤　茂昌","山中　康寛",180,"SBC",3,5,null,"5M27",1,2,2,3,2,27,"5M27",1,2,2,3,27,"6M27",1,3,3,5,27,"7M27",2,7,3,1,27,"8M27",2,4,3,5]
[null,null,null,null,null,null,null,null,null,null,null,null,null,null,null,null,null,null,null,null,null,null,null,null,null,null,null,null,null,null,2,28,1,4,"NRC",180,"植田　慎也","大橋　洋子",140,"SBC",3,6,null,"5M28",1,3,2,4,2,28,"5M28",1,3,2,4,28,"6M28",1,4,3,6,28,"7M28",2,1,3,2,28,"8M28",2,5,3,6]
[null,null,null,null,null,null,null,null,null,null,null,null,null,null,null,null,null,null,null,null,null,null,null,null,null,null,null,null,null,null,2,29,1,5,"NRC",180,"長谷川　進","林　秀忠",180,"SBC",3,1,null,"5M29",1,4,2,5,2,29,"5M29",1,4,2,5,29,"6M29",1,5,3,1,29,"7M29",1,1,3,3,29,"8M29",2,6,3,7]
[null,null,null,null,null,null,null,null,null,null,null,null,null,null,null,null,null,null,null,null,null,null,null,null,null,null,null,null,null,null,2,30,1,6,"NRC",140,"宮野　早織","秋田　倫央",180,"SBC",3,2,null,"5M30",1,5,2,1,2,30,"5M30",1,5,2,1,30,"6M30",1,6,3,2,30,"7M30",1,2,3,4,30,"8M30",2,7,3,8]
[null,null,null,null,null,null,null,null,null,null,null,null,null,null,null,null,null,null,null,null,null,null,null,null,null,null,null,null,null,null,2,31,1,1,"NRC",180,"岩本　剛","金井　健太郎",180,"HRC",2,2,null,"5M31",2,3,3,5,3,31,"5M31",2,3,3,5,31,"6M31",1,1,2,2,31,"7M31",1,3,3,5,31,"8M31",2,8,3,1]
[null,null,null,null,null,null,null,null,null,null,null,null,null,null,null,null,null,null,null,null,null,null,null,null,null,null,null,null,null,null,2,32,1,2,"NRC",180,"吉向　翔平","平井　洸志",180,"HRC",2,3,null,"5M32",2,4,3,1,3,32,"5M32",2,4,3,1,32,"6M32",1,2,2,3,32,"7M32",1,4,3,6,32,"8M32",2,1,3,2]
[null,null,null,null,null,null,null,null,null,null,null,null,null,null,null,null,null,null,null,null,null,null,null,null,null,null,null,null,null,null,2,33,1,3,"NRC",{"$f":"VLOOKUP(VALUE(AG83&AH83),$AI$5:$AL$28,4,FALSE)","v":180},{"$f":"VLOOKUP(VALUE(AG83&AH83),$AI$5:$AL$28,3,FALSE)","v":"金澤　茂昌"},{"$f":"VLOOKUP(VALUE(AO83&AP83),$AI$5:$AL$28,3,FALSE)","v":"中尾　亮太"},{"$f":"VLOOKUP(VALUE(AO83&AP83),$AI$5:$AL$28,4,FALSE)","v":180},"HRC",2,4,null,"5M33",2,5,3,2,3,33,"5M33",2,5,3,2,33,"6M33",1,3,2,4,33,"7M33",1,5,3,7,33,"8M33",1,1,3,3]
[null,null,null,null,null,null,null,null,null,null,null,null,null,null,null,null,null,null,null,null,null,null,null,null,null,null,null,null,null,null,2,34,1,4,"NRC",180,"植田　慎也","宮本　一",180,"HRC",2,5,null,"5M34",2,1,3,3,3,34,"5M34",2,1,3,3,34,"6M34",1,4,2,5,34,"7M34",1,6,3,1,34,"8M34",1,2,3,4]
[null,null,null,null,null,null,null,null,null,null,null,null,null,null,null,null,null,null,null,null,null,null,null,null,null,null,null,null,null,null,2,35,1,5,"NRC",180,"長谷川　進","河地　恵里",140,"HRC",2,6,null,"5M35",2,2,3,4,3,35,"5M35",2,2,3,4,35,"6M35",1,5,2,6,35,"7M35",1,7,3,2,35,"8M35",1,3,3,5]
[null,null,null,null,null,null,null,null,null,null,null,null,null,null,null,null,null,null,null,null,null,null,null,null,null,null,null,null,null,null,2,36,1,6,"NRC",140,"宮野　早織","高木　俊行",180,"HRC",2,1,null,"5M36",1,1,3,5,3,36,"5M36",1,1,3,5,36,"6M36",1,6,2,1,36,"7M36",1,1,2,2,36,"8M36",1,4,3,6]
[null,null,null,null,null,null,null,null,null,null,null,null,null,null,null,null,null,null,null,null,null,null,null,null,null,null,null,null,null,null,3,37,2,{"$f":"VLOOKUP($AI$49&AF87,$AR$51:$AW$1166,3,FALSE)","v":3},{"$f":"VLOOKUP(AG87,$AH$44:$AI$46,2,FALSE)","v":"HRC"},180,"平井　洸志","山中　康寛",180,"SBC",{"$f":"VLOOKUP($AI$49&AF87,$AR$51:$AW$1166,4,FALSE)","v":3},{"$f":"VLOOKUP($AI$49&AF87,$AR$51:$AW$1166,5,FALSE)","v":5},null,"5M37",1,2,3,1,3,37,"5M37",1,2,3,1,37,"6M37",2,3,3,5,37,"7M37",1,2,2,3,37,"8M37",1,5,3,7]
[null,null,null,null,null,null,null,null,null,null,null,null,null,null,null,null,null,null,null,null,null,null,null,null,null,null,null,null,null,null,3,38,2,4,"HRC",180,"中尾　亮太","大橋　洋子",140,"SBC",3,6,null,"5M38",1,3,3,2,3,38,"5M38",1,3,3,2,38,"6M38",2,4,3,6,38,"7M38",1,3,2,4,38,"8M38",1,6,3,8]
[null,null,null,null,null,null,null,null,null,null,null,null,null,null,null,null,null,null,null,null,null,null,null,null,null,null,null,null,null,null,3,39,2,5,"HRC",180,"宮本　一","林　秀忠",180,"SBC",3,1,null,"5M39",1,4,3,3,3,39,"5M39",1,4,3,3,39,"6M39",2,5,3,1,39,"7M39",1,4,2,5,39,"8M39",1,7,3,1]
[null,null,null,null,null,null,null,null,null,null,null,null,null,null,null,null,null,null,null,null,null,null,null,null,null,null,null,null,null,null,3,40,2,6,"HRC",140,"河地　恵里","秋田　倫央",180,"SBC",3,2,null,"5M40",1,5,3,4,3,40,"5M40",1,5,3,4,40,"6M40",2,6,3,2,40,"7M40",1,5,2,6,40,"8M40",1,8,3,2]
[null,null,null,null,null,null,null,null,null,null,null,null,null,null,null,null,null,null,null,null,null,null,null,null,null,null,null,null,null,null,3,41,2,1,"HRC",180,"高木　俊行","大橋　正寛",180,"SBC",3,3,null,"5M41",1,1,2,3,3,41,"5M41",1,1,2,3,41,"6M41",2,1,3,3,41,"7M41",1,6,2,7,41,"8M41",1,1,2,2]
[null,null,null,null,null,null,null,null,null,null,null,null,null,null,null,null,null,null,null,null,null,null,null,null,null,null,null,null,null,null,3,42,2,2,"HRC",180,"金井　健太郎","大橋　義治",180,"SBC",3,4,null,"5M42",1,2,2,4,3,42,"5M42",1,2,2,4,42,"6M42",2,2,3,4,42,"7M42",1,7,2,1,42,"8M42",1,2,2,3]
[null,null,null,null,null,null,null,null,null,null,null,null,null,null,null,null,null,null,null,null,null,null,null,null,null,null,null,null,null,null,3,43,1,1,"NRC",180,"岩本　剛","山中　康寛",180,"SBC",3,5,null,"5M43",1,3,2,5,3,43,"5M43",1,3,2,5,43,"6M43",1,1,3,5,43,"7M43",2,3,3,5,43,"8M43",1,3,2,4]
[null,null,null,null,null,null,null,null,null,null,null,null,null,null,null,null,null,null,null,null,null,null,null,null,null,null,null,null,null,null,3,44,1,2,"NRC",180,"吉向　翔平","大橋　洋子",140,"SBC",3,6,null,"5M44",1,4,2,1,3,44,"5M44",1,4,2,1,44,"6M44",1,2,3,6,44,"7M44",2,4,3,6,44,"8M44",1,4,2,5]
[null,null,null,null,null,null,null,null,null,null,null,null,null,null,null,null,null,null,null,null,null,null,null,null,null,null,null,null,null,null,3,45,1,3,"NRC",180,"金澤　茂昌","林　秀忠",180,"SBC",3,1,null,"5M45",1,5,2,2,3,45,"5M45",1,5,2,2,45,"6M45",1,3,3,1,45,"7M45",2,5,3,7,45,"8M45",1,5,2,6]
[null,null,null,null,null,null,null,null,null,null,null,null,null,null,null,null,null,null,null,null,null,null,null,null,null,null,null,null,null,null,3,46,1,4,"NRC",180,"植田　慎也","秋田　倫央",180,"SBC",3,2,null,"6M1",2,1,3,1,1,null,null,null,null,null,null,46,"6M46",1,4,3,2,46,"7M46",2,6,3,1,46,"8M46",1,6,2,7]
[null,null,null,null,null,null,null,null,null,null,null,null,null,null,null,null,null,null,null,null,null,null,null,null,null,null,null,null,null,null,3,47,1,5,"NRC",180,"長谷川　進","大橋　正寛",180,"SBC",3,3,null,"6M2",2,2,3,2,1,null,null,null,null,null,null,47,"6M47",1,5,3,3,47,"7M47",2,7,3,2,47,"8M47",1,7,2,8]
[null,null,null,null,null,null,null,null,null,null,null,null,null,null,null,null,null,null,null,null,null,null,null,null,null,null,null,null,null,null,3,48,1,6,"NRC",140,"宮野　早織","大橋　義治",180,"SBC",3,4,null,"6M3",2,3,3,3,1,null,null,null,null,null,null,48,"6M48",1,6,3,4,48,"7M48",2,1,3,3,48,"8M48",1,8,2,1]
[null,null,null,null,null,null,null,null,null,null,null,null,null,null,null,null,null,null,null,null,null,null,null,null,null,null,null,null,null,null,3,49,1,1,"NRC",180,"岩本　剛","平井　洸志",180,"HRC",2,3,null,"6M4",2,4,3,4,1,null,null,null,null,null,null,49,"6M49",1,1,2,3,49,"7M49",2,2,3,4,49,"8M49",2,3,3,5]
[null,null,null,null,null,null,null,null,null,null,null,null,null,null,null,null,null,null,null,null,null,null,null,null,null,null,null,null,null,null,3,50,1,2,"NRC",180,"吉向　翔平","中尾　亮太",180,"HRC",2,4,null,"6M5",2,5,3,5,1,null,null,null,null,null,null,50,"6M50",1,2,2,4,50,"7M50",1,1,3,5,50,"8M50",2,4,3,6]
[null,null,null,null,null,null,null,null,null,null,null,null,null,null,null,null,null,null,null,null,null,null,null,null,null,null,null,null,null,null,3,51,1,3,"NRC",180,"金澤　茂昌","宮本　一",180,"HRC",2,5,null,"6M6",2,6,3,6,1,null,null,null,null,null,null,51,"6M51",1,3,2,5,51,"7M51",1,2,3,6,51,"8M51",2,5,3,7]
[null,null,null,null,null,null,null,null,null,null,null,null,null,null,null,null,null,null,null,null,null,null,null,null,null,null,null,null,null,null,3,52,1,4,"NRC",180,"植田　慎也","河地　恵里",140,"HRC",2,6,null,"6M7",1,1,3,1,1,null,null,null,null,null,null,52,"6M52",1,4,2,6,52,"7M52",1,3,3,7,52,"8M52",2,6,3,8]
[null,null,null,null,null,null,null,null,null,null,null,null,null,null,null,null,null,null,null,null,null,null,null,null,null,null,null,null,null,null,3,53,1,5,"NRC",180,"長谷川　進","高木　俊行",180,"HRC",2,1,null,"6M8",1,2,3,2,1,null,null,null,null,null,null,53,"6M53",1,5,2,1,53,"7M53",1,4,3,1,53,"8M53",2,7,3,1]
[null,null,null,null,null,null,null,null,null,null,null,null,null,null,null,null,null,null,null,null,null,null,null,null,null,null,null,null,null,null,3,54,1,6,"NRC",140,"宮野　早織","金井　健太郎",180,"HRC",2,2,null,"6M9",1,3,3,3,1,null,null,null,null,null,null,54,"6M54",1,6,2,2,54,"7M54",1,5,3,2,54,"8M54",2,8,3,2]
[null,null,null,null,null,null,null,null,null,null,null,null,null,null,null,null,null,null,null,null,null,null,null,null,null,null,null,null,null,null,{"$error":"#N/A"},55,{"$error":"#N/A"},{"$error":"#N/A"},{"$error":"#N/A"},{"$error":"#N/A"},{"$error":"#N/A"},{"$error":"#N/A"},{"$error":"#N/A"},{"$error":"#N/A"},{"$error":"#N/A"},{"$error":"#N/A"},null,"6M10",1,4,3,4,1,null,null,null,null,null,null,null,null,null,null,null,null,55,"7M55",1,6,3,3,55,"8M55",2,1,3,3]
[null,null,null,null,null,null,null,null,null,null,null,null,null,null,null,null,null,null,null,null,null,null,null,null,null,null,null,null,null,null,{"$error":"#N/A"},56,{"$error":"#N/A"},{"$error":"#N/A"},{"$error":"#N/A"},{"$error":"#N/A"},{"$error":"#N/A"},{"$error":"#N/A"},{"$error":"#N/A"},{"$error":"#N/A"},{"$error":"#N/A"},{"$error":"#N/A"},null,"6M11",1,5,3,5,1,null,null,null,null,null,null,null,null,null,null,null,null,56,"7M56",1,7,3,4,56,"8M56",2,2,3,4]
[null,null,null,null,null,null,null,null,null,null,null,null,null,null,null,null,null,null,null,null,null,null,null,null,null,null,null,null,null,null,{"$error":"#N/A"},57,{"$error":"#N/A"},{"$error":"#N/A"},{"$error":"#N/A"},{"$error":"#N/A"},{"$error":"#N/A"},{"$error":"#N/A"},{"$error":"#N/A"},{"$error":"#N/A"},{"$error":"#N/A"},{"$error":"#N/A"},null,"6M12",1,6,3,6,1,null,null,null,null,null,null,null,null,null,null,null,null,57,"7M57",1,1,2,3,57,"8M57",1,1,3,5]
[null,null,null,null,null,null,null,null,null,null,null,null,null,null,null,null,null,null,null,null,null,null,null,null,null,null,null,null,null,null,{"$error":"#N/A"},58,{"$error":"#N/A"},{"$error":"#N/A"},{"$error":"#N/A"},{"$error":"#N/A"},{"$error":"#N/A"},{"$error":"#N/A"},{"$error":"#N/A"},{"$error":"#N/A"},{"$error":"#N/A"},{"$error":"#N/A"},null,"6M13",1,1,2,1,1,null,null,null,null,null,null,null,null,null,null,null,null,58,"7M58",1,2,2,4,58,"8M58",1,2,3,6]
[null,null,null,null,null,null,null,null,null,null,null,null,null,null,null,null,null,null,null,null,null,null,null,null,null,null,null,null,null,null,{"$error":"#N/A"},59,{"$error":"#N/A"},{"$error":"#N/A"},{"$error":"#N/A"},{"$error":"#N/A"},{"$error":"#N/A"},{"$error":"#N/A"},{"$error":"#N/A"},{"$error":"#N/A"},{"$error":"#N/A"},{"$error":"#N/A"},null,"6M14",1,2,2,2,1,null,null,null,null,null,null,null,null,null,null,null,null,59,"7M59",1,3,2,5,59,"8M59",1,3,3,7]
[null,null,null,null,null,null,null,null,null,null,null,null,null,null,null,null,null,null,null,null,null,null,null,null,null,null,null,null,null,null,{"$error":"#N/A"},60,{"$error":"#N/A"},{"$error":"#N/A"},{"$error":"#N/A"},{"$error":"#N/A"},{"$error":"#N/A"},{"$error":"#N/A"},{"$error":"#N/A"},{"$error":"#N/A"},{"$error":"#N/A"},{"$error":"#N/A"},null,"6M15",1,3,2,3,1,null,null,null,null,null,null,null,null,null,null,null,null,60,"7M60",1,4,2,6,60,"8M60",1,4,3,8]
[null,null,null,null,null,null,null,null,null,null,null,null,null,null,null,null,null,null,null,null,null,null,null,null,null,null,null,null,null,null,{"$error":"#N/A"},61,{"$error":"#N/A"},{"$error":"#N/A"},{"$error":"#N/A"},{"$error":"#N/A"},{"$error":"#N/A"},{"$error":"#N/A"},{"$error":"#N/A"},{"$error":"#N/A"},{"$error":"#N/A"},{"$error":"#N/A"},null,"6M16",1,4,2,4,1,null,null,null,null,null,null,null,null,null,null,null,null,61,"7M61",1,5,2,7,61,"8M61",1,5,3,1]
[null,null,null,null,null,null,null,null,null,null,null,null,null,null,null,null,null,null,null,null,null,null,null,null,null,null,null,null,null,null,{"$error":"#N/A"},62,{"$error":"#N/A"},{"$error":"#N/A"},{"$error":"#N/A"},{"$error":"#N/A"},{"$error":"#N/A"},{"$error":"#N/A"},{"$error":"#N/A"},{"$error":"#N/A"},{"$error":"#N/A"},{"$error":"#N/A"},null,"6M17",1,5,2,5,1,null,null,null,null,null,null,null,null,null,null,null,null,62,"7M62",1,6,2,1,62,"8M62",1,6,3,2]
[null,null,null,null,null,null,null,null,null,null,null,null,null,null,null,null,null,null,null,null,null,null,null,null,null,null,null,null,null,null,{"$error":"#N/A"},63,{"$error":"#N/A"},{"$error":"#N/A"},{"$error":"#N/A"},{"$error":"#N/A"},{"$error":"#N/A"},{"$error":"#N/A"},{"$error":"#N/A"},{"$error":"#N/A"},{"$error":"#N/A"},{"$error":"#N/A"},null,"6M18",1,6,2,6,1,null,null,null,null,null,null,null,null,null,null,null,null,63,"7M63",1,7,2,2,63,"8M63",1,7,3,3]
[null,null,null,null,null,null,null,null,null,null,null,null,null,null,null,null,null,null,null,null,null,null,null,null,null,null,null,null,null,null,{"$error":"#N/A"},64,{"$error":"#N/A"},{"$error":"#N/A"},{"$error":"#N/A"},{"$error":"#N/A"},{"$error":"#N/A"},{"$error":"#N/A"},{"$error":"#N/A"},{"$error":"#N/A"},{"$error":"#N/A"},{"$error":"#N/A"},null,"6M19",2,2,3,3,2,null,null,null,null,null,null,null,null,null,null,null,null,null,null,null,null,null,null,64,"8M64",1,8,3,4]
[null,null,null,null,null,null,null,null,null,null,null,null,null,null,null,null,null,null,null,null,null,null,null,null,null,null,null,null,null,null,{"$error":"#N/A"},65,{"$error":"#N/A"},{"$error":"#N/A"},{"$error":"#N/A"},{"$f":"VLOOKUP(VALUE(AG115&AH115),$AI$5:$AL$28,4,FALSE)","v":{"$error":"#N/A"}},{"$f":"VLOOKUP(VALUE(AG115&AH115),$AI$5:$AL$28,3,FALSE)","v":{"$error":"#N/A"}},{"$f":"VLOOKUP(VALUE(AO115&AP115),$AI$5:$AL$28,3,FALSE)","v":{"$error":"#N/A"}},{"$f":"VLOOKUP(VALUE(AO115&AP115),$AI$5:$AL$28,4,FALSE)","v":{"$error":"#N/A"}},{"$error":"#N/A"},{"$error":"#N/A"},{"$error":"#N/A"},null,"6M20",2,3,3,4,2,null,null,null,null,null,null,null,null,null,null,null,null,null,null,null,null,null,null,65,"8M65",1,1,2,3]
[null,null,null,null,null,null,null,null,null,null,null,null,null,null,null,null,null,null,null,null,null,null,null,null,null,null,null,null,null,null,{"$f":"VLOOKUP($AI$49&AF116,$AR$51:$AW$1166,6,FALSE)","v":{"$error":"#N/A"}},66,{"$f":"VLOOKUP($AI$49&AF116,$AR$51:$AW$1166,2,FALSE)","v":{"$error":"#N/A"}},{"$error":"#N/A"},{"$error":"#N/A"},{"$error":"#N/A"},{"$error":"#N/A"},{"$error":"#N/A"},{"$error":"#N/A"},{"$f":"VLOOKUP(AO116,$AH$44:$AI$46,2,FALSE)","v":{"$error":"#N/A"}},{"$error":"#N/A"},{"$error":"#N/A"},null,"6M21",2,4,3,5,2,null,null,null,null,null,null,null,null,null,null,null,null,null,null,null,null,null,null,66,{"$f":"$BP$49&$BQ$49&BP116","v":"8M66"},1,2,2,4]
[null,null,null,null,null,null,null,null,null,null,null,null,null,null,null,null,null,null,null,null,null,null,null,null,null,null,null,null,null,null,{"$error":"#N/A"},67,{"$error":"#N/A"},{"$error":"#N/A"},{"$error":"#N/A"},{"$error":"#N/A"},{"$error":"#N/A"},{"$error":"#N/A"},{"$error":"#N/A"},{"$error":"#N/A"},{"$error":"#N/A"},{"$error":"#N/A"},null,"6M22",2,5,3,6,2,null,null,null,null,null,null,null,null,null,null,null,null,null,null,null,null,null,null,67,"8M67",1,3,2,5]
[null,null,null,null,null,null,null,null,null,null,null,null,null,null,null,null,null,null,null,null,null,null,null,null,null,null,null,null,null,null,{"$error":"#N/A"},68,{"$error":"#N/A"},{"$error":"#N/A"},{"$error":"#N/A"},{"$error":"#N/A"},{"$error":"#N/A"},{"$error":"#N/A"},{"$error":"#N/A"},{"$error":"#N/A"},{"$error":"#N/A"},{"$error":"#N/A"},null,"6M23",2,6,3,1,2,null,null,null,null,null,null,null,null,null,null,null,null,null,null,null,null,null,null,68,"8M68",1,4,2,6]
[null,null,null,null,null,null,null,null,null,null,null,null,null,null,null,null,null,null,null,null,null,null,null,null,null,null,null,null,null,null,{"$error":"#N/A"},69,{"$error":"#N/A"},{"$error":"#N/A"},{"$error":"#N/A"},{"$error":"#N/A"},{"$error":"#N/A"},{"$error":"#N/A"},{"$error":"#N/A"},{"$error":"#N/A"},{"$error":"#N/A"},{"$error":"#N/A"},null,"6M24",2,1,3,2,2,null,null,null,null,null,null,null,null,null,null,null,null,null,null,null,null,null,null,69,"8M69",1,5,2,7]
[null,null,null,null,null,null,null,null,null,null,null,null,null,null,null,null,null,null,null,null,null,null,null,null,null,null,null,null,null,null,{"$error":"#N/A"},70,{"$error":"#N/A"},{"$error":"#N/A"},{"$error":"#N/A"},{"$error":"#N/A"},{"$error":"#N/A"},{"$error":"#N/A"},{"$error":"#N/A"},{"$error":"#N/A"},{"$error":"#N/A"},{"$error":"#N/A"},null,"6M25",1,1,3,3,2,null,null,null,null,null,null,null,null,null,null,null,null,null,null,null,null,null,null,70,"8M70",1,6,2,8]
[null,null,null,null,null,null,null,null,null,null,null,null,null,null,null,null,null,null,null,null,null,null,null,null,null,null,null,null,null,null,{"$error":"#N/A"},71,{"$error":"#N/A"},{"$error":"#N/A"},{"$error":"#N/A"},{"$error":"#N/A"},{"$error":"#N/A"},{"$error":"#N/A"},{"$error":"#N/A"},{"$error":"#N/A"},{"$error":"#N/A"},{"$error":"#N/A"},null,"6M26",1,2,3,4,2,null,null,null,null,null,null,null,null,null,null,null,null,null,null,null,null,null,null,71,"8M71",1,7,2,1]
[null,null,null,null,null,null,null,null,null,null,null,null,null,null,null,null,null,null,null,null,null,null,null,null,null,null,null,null,null,null,{"$error":"#N/A"},72,{"$error":"#N/A"},{"$error":"#N/A"},{"$error":"#N/A"},{"$error":"#N/A"},{"$error":"#N/A"},{"$error":"#N/A"},{"$error":"#N/A"},{"$error":"#N/A"},{"$error":"#N/A"},{"$error":"#N/A"},null,"6M27",1,3,3,5,2,null,null,null,null,null,null,null,null,null,null,null,null,null,null,null,null,null,null,72,"8M72",1,8,2,2]
[null,null,null,null,null,null,null,null,null,null,null,null,null,null,null,null,null,null,null,null,null,null,null,null,null,null,null,null,null,null,null,null,null,null,null,null,null,null,null,null,null,null,null,"6M28",1,4,3,6,2]
[null,null,null,null,null,null,null,null,null,null,null,null,null,null,null,null,null,null,null,null,null,null,null,null,null,null,null,null,null,null,null,null,null,null,null,null,null,null,null,null,null,null,null,"6M29",1,5,3,1,2]
[null,null,null,null,null,null,null,null,null,null,null,null,null,null,null,null,null,null,null,null,null,null,null,null,null,null,null,null,null,null,null,null,null,null,null,null,null,null,null,null,null,null,null,"6M30",1,6,3,2,2]
[null,null,null,null,null,null,null,null,null,null,null,null,null,null,null,null,null,null,null,null,null,null,null,null,null,null,null,null,null,null,null,null,null,null,null,null,null,null,null,null,null,null,null,"6M31",1,1,2,2,2]
[null,null,null,null,null,null,null,null,null,null,null,null,null,null,null,null,null,null,null,null,null,null,null,null,null,null,null,null,null,null,null,null,null,null,null,null,null,null,null,null,null,null,null,"6M32",1,2,2,3,2]
[null,null,null,null,null,null,null,null,null,null,null,null,null,null,null,null,null,null,null,null,null,null,null,null,null,null,null,null,null,null,null,null,null,null,null,null,null,null,null,null,null,null,null,"6M33",1,3,2,4,2]
[null,null,null,null,null,null,null,null,null,null,null,null,null,null,null,null,null,null,null,null,null,null,null,null,null,null,null,null,null,null,null,null,null,null,null,null,null,null,null,null,null,null,null,"6M34",1,4,2,5,2]
[null,null,null,null,null,null,null,null,null,null,null,null,null,null,null,null,null,null,null,null,null,null,null,null,null,null,null,null,null,null,null,null,null,null,null,null,null,null,null,null,null,null,null,"6M35",1,5,2,6,2]
[null,null,null,null,null,null,null,null,null,null,null,null,null,null,null,null,null,null,null,null,null,null,null,null,null,null,null,null,null,null,null,null,null,null,null,null,null,null,null,null,null,null,null,"6M36",1,6,2,1,2]
[null,null,null,null,null,null,null,null,null,null,null,null,null,null,null,null,null,null,null,null,null,null,null,null,null,null,null,null,null,null,null,null,null,null,null,null,null,null,null,null,null,null,null,"6M37",2,3,3,5,3]
[null,null,null,null,null,null,null,null,null,null,null,null,null,null,null,null,null,null,null,null,null,null,null,null,null,null,null,null,null,null,null,null,null,null,null,null,null,null,null,null,null,null,null,"6M38",2,4,3,6,3]
[null,null,null,null,null,null,null,null,null,null,null,null,null,null,null,null,null,null,null,null,null,null,null,null,null,null,null,null,null,null,null,null,null,null,null,null,null,null,null,null,null,null,null,"6M39",2,5,3,1,3]
[null,null,null,null,null,null,null,null,null,null,null,null,null,null,null,null,null,null,null,null,null,null,null,null,null,null,null,null,null,null,null,null,null,null,null,null,null,null,null,null,null,null,null,"6M40",2,6,3,2,3]
[null,null,null,null,null,null,null,null,null,null,null,null,null,null,null,null,null,null,null,null,null,null,null,null,null,null,null,null,null,null,null,null,null,null,null,null,null,null,null,null,null,null,null,"6M41",2,1,3,3,3]
[null,null,null,null,null,null,null,null,null,null,null,null,null,null,null,null,null,null,null,null,null,null,null,null,null,null,null,null,null,null,null,null,null,null,null,null,null,null,null,null,null,null,null,"6M42",2,2,3,4,3]
[null,null,null,null,null,null,null,null,null,null,null,null,null,null,null,null,null,null,null,null,null,null,null,null,null,null,null,null,null,null,null,null,null,null,null,null,null,null,null,null,null,null,null,"6M43",1,1,3,5,3]
[null,null,null,null,null,null,null,null,null,null,null,null,null,null,null,null,null,null,null,null,null,null,null,null,null,null,null,null,null,null,null,null,null,null,null,null,null,null,null,null,null,null,null,"6M44",1,2,3,6,3]
[null,null,null,null,null,null,null,null,null,null,null,null,null,null,null,null,null,null,null,null,null,null,null,null,null,null,null,null,null,null,null,null,null,null,null,null,null,null,null,null,null,null,null,"6M45",1,3,3,1,3]
[null,null,null,null,null,null,null,null,null,null,null,null,null,null,null,null,null,null,null,null,null,null,null,null,null,null,null,null,null,null,null,null,null,null,null,null,null,null,null,null,null,null,null,"6M46",1,4,3,2,3]
[null,null,null,null,null,null,null,null,null,null,null,null,null,null,null,null,null,null,null,null,null,null,null,null,null,null,null,null,null,null,null,null,null,null,null,null,null,null,null,null,null,null,null,"6M47",1,5,3,3,3]
[null,null,null,null,null,null,null,null,null,null,null,null,null,null,null,null,null,null,null,null,null,null,null,null,null,null,null,null,null,null,null,null,null,null,null,null,null,null,null,null,null,null,null,"6M48",1,6,3,4,3]
[null,null,null,null,null,null,null,null,null,null,null,null,null,null,null,null,null,null,null,null,null,null,null,null,null,null,null,null,null,null,null,null,null,null,null,null,null,null,null,null,null,null,null,"6M49",1,1,2,3,3]
[null,null,null,null,null,null,null,null,null,null,null,null,null,null,null,null,null,null,null,null,null,null,null,null,null,null,null,null,null,null,null,null,null,null,null,null,null,null,null,null,null,null,null,"6M50",1,2,2,4,3]
[null,null,null,null,null,null,null,null,null,null,null,null,null,null,null,null,null,null,null,null,null,null,null,null,null,null,null,null,null,null,null,null,null,null,null,null,null,null,null,null,null,null,null,"6M51",1,3,2,5,3]
[null,null,null,null,null,null,null,null,null,null,null,null,null,null,null,null,null,null,null,null,null,null,null,null,null,null,null,null,null,null,null,null,null,null,null,null,null,null,null,null,null,null,null,"6M52",1,4,2,6,3]
[null,null,null,null,null,null,null,null,null,null,null,null,null,null,null,null,null,null,null,null,null,null,null,null,null,null,null,null,null,null,null,null,null,null,null,null,null,null,null,null,null,null,null,"6M53",1,5,2,1,3]
[null,null,null,null,null,null,null,null,null,null,null,null,null,null,null,null,null,null,null,null,null,null,null,null,null,null,null,null,null,null,null,null,null,null,null,null,null,null,null,null,null,null,null,"6M54",1,6,2,2,3]
[null,null,null,null,null,null,null,null,null,null,null,null,null,null,null,null,null,null,null,null,null,null,null,null,null,null,null,null,null,null,null,null,null,null,null,null,null,null,null,null,null,null,null,"7M1",2,1,3,1,1]
[null,null,null,null,null,null,null,null,null,null,null,null,null,null,null,null,null,null,null,null,null,null,null,null,null,null,null,null,null,null,null,null,null,null,null,null,null,null,null,null,null,null,null,"7M2",2,2,3,2,1]
[null,null,null,null,null,null,null,null,null,null,null,null,null,null,null,null,null,null,null,null,null,null,null,null,null,null,null,null,null,null,null,null,null,null,null,null,null,null,null,null,null,null,null,"7M3",2,3,3,3,1]
[null,null,null,null,null,null,null,null,null,null,null,null,null,null,null,null,null,null,null,null,null,null,null,null,null,null,null,null,null,null,null,null,null,null,null,null,null,null,null,null,null,null,null,"7M4",2,4,3,4,1]
[null,null,null,null,null,null,null,null,null,null,null,null,null,null,null,null,null,null,null,null,null,null,null,null,null,null,null,null,null,null,null,null,null,null,null,null,null,null,null,null,null,null,null,"7M5",2,5,3,5,1]
[null,null,null,null,null,null,null,null,null,null,null,null,null,null,null,null,null,null,null,null,null,null,null,null,null,null,null,null,null,null,null,null,null,null,null,null,null,null,null,null,null,null,null,"7M6",2,6,3,6,1]
[null,null,null,null,null,null,null,null,null,null,null,null,null,null,null,null,null,null,null,null,null,null,null,null,null,null,null,null,null,null,null,null,null,null,null,null,null,null,null,null,null,null,null,"7M7",2,7,3,7,1]
[null,null,null,null,null,null,null,null,null,null,null,null,null,null,null,null,null,null,null,null,null,null,null,null,null,null,null,null,null,null,null,null,null,null,null,null,null,null,null,null,null,null,null,"7M8",1,1,3,1,1]
[null,null,null,null,null,null,null,null,null,null,null,null,null,null,null,null,null,null,null,null,null,null,null,null,null,null,null,null,null,null,null,null,null,null,null,null,null,null,null,null,null,null,null,"7M9",1,2,3,2,1]
[null,null,null,null,null,null,null,null,null,null,null,null,null,null,null,null,null,null,null,null,null,null,null,null,null,null,null,null,null,null,null,null,null,null,null,null,null,null,null,null,null,null,null,"7M10",1,3,3,3,1]
[null,null,null,null,null,null,null,null,null,null,null,null,null,null,null,null,null,null,null,null,null,null,null,null,null,null,null,null,null,null,null,null,null,null,null,null,null,null,null,null,null,null,null,"7M11",1,4,3,4,1]
[null,null,null,null,null,null,null,null,null,null,null,null,null,null,null,null,null,null,null,null,null,null,null,null,null,null,null,null,null,null,null,null,null,null,null,null,null,null,null,null,null,null,null,"7M12",1,5,3,5,1]
[null,null,null,null,null,null,null,null,null,null,null,null,null,null,null,null,null,null,null,null,null,null,null,null,null,null,null,null,null,null,null,null,null,null,null,null,null,null,null,null,null,null,null,"7M13",1,6,3,6,1]
[null,null,null,null,null,null,null,null,null,null,null,null,null,null,null,null,null,null,null,null,null,null,null,null,null,null,null,null,null,null,null,null,null,null,null,null,null,null,null,null,null,null,null,"7M14",1,7,3,7,1]
[null,null,null,null,null,null,null,null,null,null,null,null,null,null,null,null,null,null,null,null,null,null,null,null,null,null,null,null,null,null,null,null,null,null,null,null,null,null,null,null,null,null,null,"7M15",1,1,2,1,1]
[null,null,null,null,null,null,null,null,null,null,null,null,null,null,null,null,null,null,null,null,null,null,null,null,null,null,null,null,null,null,null,null,null,null,null,null,null,null,null,null,null,null,null,"7M16",1,2,2,2,1]
[null,null,null,null,null,null,null,null,null,null,null,null,null,null,null,null,null,null,null,null,null,null,null,null,null,null,null,null,null,null,null,null,null,null,null,null,null,null,null,null,null,null,null,"7M17",1,3,2,3,1]
[null,null,null,null,null,null,null,null,null,null,null,null,null,null,null,null,null,null,null,null,null,null,null,null,null,null,null,null,null,null,null,null,null,null,null,null,null,null,null,null,null,null,null,"7M18",1,4,2,4,1]
[null,null,null,null,null,null,null,null,null,null,null,null,null,null,null,null,null,null,null,null,null,null,null,null,null,null,null,null,null,null,null,null,null,null,null,null,null,null,null,null,null,null,null,"7M19",1,5,2,5,1]
[null,null,null,null,null,null,null,null,null,null,null,null,null,null,null,null,null,null,null,null,null,null,null,null,null,null,null,null,null,null,null,null,null,null,null,null,null,null,null,null,null,null,null,"7M20",1,6,2,6,1]
[null,null,null,null,null,null,null,null,null,null,null,null,null,null,null,null,null,null,null,null,null,null,null,null,null,null,null,null,null,null,null,null,null,null,null,null,null,null,null,null,null,null,null,"7M21",1,7,2,7,1]
[null,null,null,null,null,null,null,null,null,null,null,null,null,null,null,null,null,null,null,null,null,null,null,null,null,null,null,null,null,null,null,null,null,null,null,null,null,null,null,null,null,null,null,"7M22",2,2,3,3,2]
[null,null,null,null,null,null,null,null,null,null,null,null,null,null,null,null,null,null,null,null,null,null,null,null,null,null,null,null,null,null,null,null,null,null,null,null,null,null,null,null,null,null,null,"7M23",2,3,3,4,2]
[null,null,null,null,null,null,null,null,null,null,null,null,null,null,null,null,null,null,null,null,null,null,null,null,null,null,null,null,null,null,null,null,null,null,null,null,null,null,null,null,null,null,null,"7M24",2,4,3,5,2]
[null,null,null,null,null,null,null,null,null,null,null,null,null,null,null,null,null,null,null,null,null,null,null,null,null,null,null,null,null,null,null,null,null,null,null,null,null,null,null,null,null,null,null,"7M25",2,5,3,6,2]
[null,null,null,null,null,null,null,null,null,null,null,null,null,null,null,null,null,null,null,null,null,null,null,null,null,null,null,null,null,null,null,null,null,null,null,null,null,null,null,null,null,null,null,"7M26",2,6,3,7,2]
[null,null,null,null,null,null,null,null,null,null,null,null,null,null,null,null,null,null,null,null,null,null,null,null,null,null,null,null,null,null,null,null,null,null,null,null,null,null,null,null,null,null,null,"7M27",2,7,3,1,2]
[null,null,null,null,null,null,null,null,null,null,null,null,null,null,null,null,null,null,null,null,null,null,null,null,null,null,null,null,null,null,null,null,null,null,null,null,null,null,null,null,null,null,null,"7M28",2,1,3,2,2]
[null,null,null,null,null,null,null,null,null,null,null,null,null,null,null,null,null,null,null,null,null,null,null,null,null,null,null,null,null,null,null,null,null,null,null,null,null,null,null,null,null,null,null,"7M29",1,1,3,3,2]
[null,null,null,null,null,null,null,null,null,null,null,null,null,null,null,null,null,null,null,null,null,null,null,null,null,null,null,null,null,null,null,null,null,null,null,null,null,null,null,null,null,null,null,"7M30",1,2,3,4,2]
[null,null,null,null,null,null,null,null,null,null,null,null,null,null,null,null,null,null,null,null,null,null,null,null,null,null,null,null,null,null,null,null,null,null,null,null,null,null,null,null,null,null,null,"7M31",1,3,3,5,2]
[null,null,null,null,null,null,null,null,null,null,null,null,null,null,null,null,null,null,null,null,null,null,null,null,null,null,null,null,null,null,null,null,null,null,null,null,null,null,null,null,null,null,null,"7M32",1,4,3,6,2]
[null,null,null,null,null,null,null,null,null,null,null,null,null,null,null,null,null,null,null,null,null,null,null,null,null,null,null,null,null,null,null,null,null,null,null,null,null,null,null,null,null,null,null,"7M33",1,5,3,7,2]
[null,null,null,null,null,null,null,null,null,null,null,null,null,null,null,null,null,null,null,null,null,null,null,null,null,null,null,null,null,null,null,null,null,null,null,null,null,null,null,null,null,null,null,"7M34",1,6,3,1,2]
[null,null,null,null,null,null,null,null,null,null,null,null,null,null,null,null,null,null,null,null,null,null,null,null,null,null,null,null,null,null,null,null,null,null,null,null,null,null,null,null,null,null,null,"7M35",1,7,3,2,2]
[null,null,null,null,null,null,null,null,null,null,null,null,null,null,null,null,null,null,null,null,null,null,null,null,null,null,null,null,null,null,null,null,null,null,null,null,null,null,null,null,null,null,null,"7M36",1,1,2,2,2]
[null,null,null,null,null,null,null,null,null,null,null,null,null,null,null,null,null,null,null,null,null,null,null,null,null,null,null,null,null,null,null,null,null,null,null,null,null,null,null,null,null,null,null,"7M37",1,2,2,3,2]
[null,null,null,null,null,null,null,null,null,null,null,null,null,null,null,null,null,null,null,null,null,null,null,null,null,null,null,null,null,null,null,null,null,null,null,null,null,null,null,null,null,null,null,"7M38",1,3,2,4,2]
[null,null,null,null,null,null,null,null,null,null,null,null,null,null,null,null,null,null,null,null,null,null,null,null,null,null,null,null,null,null,null,null,null,null,null,null,null,null,null,null,null,null,null,"7M39",1,4,2,5,2]
[null,null,null,null,null,null,null,null,null,null,null,null,null,null,null,null,null,null,null,null,null,null,null,null,null,null,null,null,null,null,null,null,null,null,null,null,null,null,null,null,null,null,null,"7M40",1,5,2,6,2]
[null,null,null,null,null,null,null,null,null,null,null,null,null,null,null,null,null,null,null,null,null,null,null,null,null,null,null,null,null,null,null,null,null,null,null,null,null,null,null,null,null,null,null,"7M41",1,6,2,7,2]
[null,null,null,null,null,null,null,null,null,null,null,null,null,null,null,null,null,null,null,null,null,null,null,null,null,null,null,null,null,null,null,null,null,null,null,null,null,null,null,null,null,null,null,"7M42",1,7,2,1,2]
[null,null,null,null,null,null,null,null,null,null,null,null,null,null,null,null,null,null,null,null,null,null,null,null,null,null,null,null,null,null,null,null,null,null,null,null,null,null,null,null,null,null,null,"7M43",2,3,3,5,3]
[null,null,null,null,null,null,null,null,null,null,null,null,null,null,null,null,null,null,null,null,null,null,null,null,null,null,null,null,null,null,null,null,null,null,null,null,null,null,null,null,null,null,null,"7M44",2,4,3,6,3]
[null,null,null,null,null,null,null,null,null,null,null,null,null,null,null,null,null,null,null,null,null,null,null,null,null,null,null,null,null,null,null,null,null,null,null,null,null,null,null,null,null,null,null,"7M45",2,5,3,7,3]
[null,null,null,null,null,null,null,null,null,null,null,null,null,null,null,null,null,null,null,null,null,null,null,null,null,null,null,null,null,null,null,null,null,null,null,null,null,null,null,null,null,null,null,"7M46",2,6,3,1,3]
[null,null,null,null,null,null,null,null,null,null,null,null,null,null,null,null,null,null,null,null,null,null,null,null,null,null,null,null,null,null,null,null,null,null,null,null,null,null,null,null,null,null,null,"7M47",2,7,3,2,3]
[null,null,null,null,null,null,null,null,null,null,null,null,null,null,null,null,null,null,null,null,null,null,null,null,null,null,null,null,null,null,null,null,null,null,null,null,null,null,null,null,null,null,null,"7M48",2,1,3,3,3]
[null,null,null,null,null,null,null,null,null,null,null,null,null,null,null,null,null,null,null,null,null,null,null,null,null,null,null,null,null,null,null,null,null,null,null,null,null,null,null,null,null,null,null,"7M49",2,2,3,4,3]
[null,null,null,null,null,null,null,null,null,null,null,null,null,null,null,null,null,null,null,null,null,null,null,null,null,null,null,null,null,null,null,null,null,null,null,null,null,null,null,null,null,null,null,"7M50",1,1,3,5,3]
[null,null,null,null,null,null,null,null,null,null,null,null,null,null,null,null,null,null,null,null,null,null,null,null,null,null,null,null,null,null,null,null,null,null,null,null,null,null,null,null,null,null,null,"7M51",1,2,3,6,3]
[null,null,null,null,null,null,null,null,null,null,null,null,null,null,null,null,null,null,null,null,null,null,null,null,null,null,null,null,null,null,null,null,null,null,null,null,null,null,null,null,null,null,null,"7M52",1,3,3,7,3]
[null,null,null,null,null,null,null,null,null,null,null,null,null,null,null,null,null,null,null,null,null,null,null,null,null,null,null,null,null,null,null,null,null,null,null,null,null,null,null,null,null,null,null,"7M53",1,4,3,1,3]
[null,null,null,null,null,null,null,null,null,null,null,null,null,null,null,null,null,null,null,null,null,null,null,null,null,null,null,null,null,null,null,null,null,null,null,null,null,null,null,null,null,null,null,"7M54",1,5,3,2,3]
[null,null,null,null,null,null,null,null,null,null,null,null,null,null,null,null,null,null,null,null,null,null,null,null,null,null,null,null,null,null,null,null,null,null,null,null,null,null,null,null,null,null,null,"7M55",1,6,3,3,3]
[null,null,null,null,null,null,null,null,null,null,null,null,null,null,null,null,null,null,null,null,null,null,null,null,null,null,null,null,null,null,null,null,null,null,null,null,null,null,null,null,null,null,null,"7M56",1,7,3,4,3]
[null,null,null,null,null,null,null,null,null,null,null,null,null,null,null,null,null,null,null,null,null,null,null,null,null,null,null,null,null,null,null,null,null,null,null,null,null,null,null,null,null,null,null,"7M57",1,1,2,3,3]
[null,null,null,null,null,null,null,null,null,null,null,null,null,null,null,null,null,null,null,null,null,null,null,null,null,null,null,null,null,null,null,null,null,null,null,null,null,null,null,null,null,null,null,"7M58",1,2,2,4,3]
[null,null,null,null,null,null,null,null,null,null,null,null,null,null,null,null,null,null,null,null,null,null,null,null,null,null,null,null,null,null,null,null,null,null,null,null,null,null,null,null,null,null,null,"7M59",1,3,2,5,3]
[null,null,null,null,null,null,null,null,null,null,null,null,null,null,null,null,null,null,null,null,null,null,null,null,null,null,null,null,null,null,null,null,null,null,null,null,null,null,null,null,null,null,null,"7M60",1,4,2,6,3]
[null,null,null,null,null,null,null,null,null,null,null,null,null,null,null,null,null,null,null,null,null,null,null,null,null,null,null,null,null,null,null,null,null,null,null,null,null,null,null,null,null,null,null,"7M61",1,5,2,7,3]
[null,null,null,null,null,null,null,null,null,null,null,null,null,null,null,null,null,null,null,null,null,null,null,null,null,null,null,null,null,null,null,null,null,null,null,null,null,null,null,null,null,null,null,"7M62",1,6,2,1,3]
[null,null,null,null,null,null,null,null,null,null,null,null,null,null,null,null,null,null,null,null,null,null,null,null,null,null,null,null,null,null,null,null,null,null,null,null,null,null,null,null,null,null,null,"7M63",1,7,2,2,3]
[null,null,null,null,null,null,null,null,null,null,null,null,null,null,null,null,null,null,null,null,null,null,null,null,null,null,null,null,null,null,null,null,null,null,null,null,null,null,null,null,null,null,null,"8M1",2,1,3,1,1]
[null,null,null,null,null,null,null,null,null,null,null,null,null,null,null,null,null,null,null,null,null,null,null,null,null,null,null,null,null,null,null,null,null,null,null,null,null,null,null,null,null,null,null,"8M2",2,2,3,2,1]
[null,null,null,null,null,null,null,null,null,null,null,null,null,null,null,null,null,null,null,null,null,null,null,null,null,null,null,null,null,null,null,null,null,null,null,null,null,null,null,null,null,null,null,"8M3",2,3,3,3,1]
[null,null,null,null,null,null,null,null,null,null,null,null,null,null,null,null,null,null,null,null,null,null,null,null,null,null,null,null,null,null,null,null,null,null,null,null,null,null,null,null,null,null,null,"8M4",2,4,3,4,1]
[null,null,null,null,null,null,null,null,null,null,null,null,null,null,null,null,null,null,null,null,null,null,null,null,null,null,null,null,null,null,null,null,null,null,null,null,null,null,null,null,null,null,null,"8M5",2,5,3,5,1]
[null,null,null,null,null,null,null,null,null,null,null,null,null,null,null,null,null,null,null,null,null,null,null,null,null,null,null,null,null,null,null,null,null,null,null,null,null,null,null,null,null,null,null,"8M6",2,6,3,6,1]
[null,null,null,null,null,null,null,null,null,null,null,null,null,null,null,null,null,null,null,null,null,null,null,null,null,null,null,null,null,null,null,null,null,null,null,null,null,null,null,null,null,null,null,"8M7",2,7,3,7,1]
[null,null,null,null,null,null,null,null,null,null,null,null,null,null,null,null,null,null,null,null,null,null,null,null,null,null,null,null,null,null,null,null,null,null,null,null,null,null,null,null,null,null,null,"8M8",2,8,3,8,1]
[null,null,null,null,null,null,null,null,null,null,null,null,null,null,null,null,null,null,null,null,null,null,null,null,null,null,null,null,null,null,null,null,null,null,null,null,null,null,null,null,null,null,null,"8M9",1,1,3,1,1]
[null,null,null,null,null,null,null,null,null,null,null,null,null,null,null,null,null,null,null,null,null,null,null,null,null,null,null,null,null,null,null,null,null,null,null,null,null,null,null,null,null,null,null,"8M10",1,2,3,2,1]
[null,null,null,null,null,null,null,null,null,null,null,null,null,null,null,null,null,null,null,null,null,null,null,null,null,null,null,null,null,null,null,null,null,null,null,null,null,null,null,null,null,null,null,"8M11",1,3,3,3,1]
[null,null,null,null,null,null,null,null,null,null,null,null,null,null,null,null,null,null,null,null,null,null,null,null,null,null,null,null,null,null,null,null,null,null,null,null,null,null,null,null,null,null,null,"8M12",1,4,3,4,1]
[null,null,null,null,null,null,null,null,null,null,null,null,null,null,null,null,null,null,null,null,null,null,null,null,null,null,null,null,null,null,null,null,null,null,null,null,null,null,null,null,null,null,null,"8M13",1,5,3,5,1]
[null,null,null,null,null,null,null,null,null,null,null,null,null,null,null,null,null,null,null,null,null,null,null,null,null,null,null,null,null,null,null,null,null,null,null,null,null,null,null,null,null,null,null,"8M14",1,6,3,6,1]
[null,null,null,null,null,null,null,null,null,null,null,null,null,null,null,null,null,null,null,null,null,null,null,null,null,null,null,null,null,null,null,null,null,null,null,null,null,null,null,null,null,null,null,"8M15",1,7,3,7,1]
[null,null,null,null,null,null,null,null,null,null,null,null,null,null,null,null,null,null,null,null,null,null,null,null,null,null,null,null,null,null,null,null,null,null,null,null,null,null,null,null,null,null,null,"8M16",1,8,3,8,1]
[null,null,null,null,null,null,null,null,null,null,null,null,null,null,null,null,null,null,null,null,null,null,null,null,null,null,null,null,null,null,null,null,null,null,null,null,null,null,null,null,null,null,null,"8M17",1,1,2,1,1]
[null,null,null,null,null,null,null,null,null,null,null,null,null,null,null,null,null,null,null,null,null,null,null,null,null,null,null,null,null,null,null,null,null,null,null,null,null,null,null,null,null,null,null,"8M18",1,2,2,2,1]
[null,null,null,null,null,null,null,null,null,null,null,null,null,null,null,null,null,null,null,null,null,null,null,null,null,null,null,null,null,null,null,null,null,null,null,null,null,null,null,null,null,null,null,"8M19",1,3,2,3,1]
[null,null,null,null,null,null,null,null,null,null,null,null,null,null,null,null,null,null,null,null,null,null,null,null,null,null,null,null,null,null,null,null,null,null,null,null,null,null,null,null,null,null,null,"8M20",1,4,2,4,1]
[null,null,null,null,null,null,null,null,null,null,null,null,null,null,null,null,null,null,null,null,null,null,null,null,null,null,null,null,null,null,null,null,null,null,null,null,null,null,null,null,null,null,null,"8M21",1,5,2,5,1]
[null,null,null,null,null,null,null,null,null,null,null,null,null,null,null,null,null,null,null,null,null,null,null,null,null,null,null,null,null,null,null,null,null,null,null,null,null,null,null,null,null,null,null,"8M22",1,6,2,6,1]
[null,null,null,null,null,null,null,null,null,null,null,null,null,null,null,null,null,null,null,null,null,null,null,null,null,null,null,null,null,null,null,null,null,null,null,null,null,null,null,null,null,null,null,"8M23",1,7,2,7,1]
[null,null,null,null,null,null,null,null,null,null,null,null,null,null,null,null,null,null,null,null,null,null,null,null,null,null,null,null,null,null,null,null,null,null,null,null,null,null,null,null,null,null,null,"8M24",1,8,2,8,1]
[null,null,null,null,null,null,null,null,null,null,null,null,null,null,null,null,null,null,null,null,null,null,null,null,null,null,null,null,null,null,null,null,null,null,null,null,null,null,null,null,null,null,null,"8M25",2,2,3,3,2]
[null,null,null,null,null,null,null,null,null,null,null,null,null,null,null,null,null,null,null,null,null,null,null,null,null,null,null,null,null,null,null,null,null,null,null,null,null,null,null,null,null,null,null,"8M26",2,3,3,4,2]
[null,null,null,null,null,null,null,null,null,null,null,null,null,null,null,null,null,null,null,null,null,null,null,null,null,null,null,null,null,null,null,null,null,null,null,null,null,null,null,null,null,null,null,"8M27",2,4,3,5,2]
[null,null,null,null,null,null,null,null,null,null,null,null,null,null,null,null,null,null,null,null,null,null,null,null,null,null,null,null,null,null,null,null,null,null,null,null,null,null,null,null,null,null,null,"8M28",2,5,3,6,2]
[null,null,null,null,null,null,null,null,null,null,null,null,null,null,null,null,null,null,null,null,null,null,null,null,null,null,null,null,null,null,null,null,null,null,null,null,null,null,null,null,null,null,null,"8M29",2,6,3,7,2]
[null,null,null,null,null,null,null,null,null,null,null,null,null,null,null,null,null,null,null,null,null,null,null,null,null,null,null,null,null,null,null,null,null,null,null,null,null,null,null,null,null,null,null,"8M30",2,7,3,8,2]
[null,null,null,null,null,null,null,null,null,null,null,null,null,null,null,null,null,null,null,null,null,null,null,null,null,null,null,null,null,null,null,null,null,null,null,null,null,null,null,null,null,null,null,"8M31",2,8,3,1,2]
[null,null,null,null,null,null,null,null,null,null,null,null,null,null,null,null,null,null,null,null,null,null,null,null,null,null,null,null,null,null,null,null,null,null,null,null,null,null,null,null,null,null,null,"8M32",2,1,3,2,2]
[null,null,null,null,null,null,null,null,null,null,null,null,null,null,null,null,null,null,null,null,null,null,null,null,null,null,null,null,null,null,null,null,null,null,null,null,null,null,null,null,null,null,null,"8M33",1,1,3,3,2]
[null,null,null,null,null,null,null,null,null,null,null,null,null,null,null,null,null,null,null,null,null,null,null,null,null,null,null,null,null,null,null,null,null,null,null,null,null,null,null,null,null,null,null,"8M34",1,2,3,4,2]
[null,null,null,null,null,null,null,null,null,null,null,null,null,null,null,null,null,null,null,null,null,null,null,null,null,null,null,null,null,null,null,null,null,null,null,null,null,null,null,null,null,null,null,"8M35",1,3,3,5,2]
[null,null,null,null,null,null,null,null,null,null,null,null,null,null,null,null,null,null,null,null,null,null,null,null,null,null,null,null,null,null,null,null,null,null,null,null,null,null,null,null,null,null,null,"8M36",1,4,3,6,2]
[null,null,null,null,null,null,null,null,null,null,null,null,null,null,null,null,null,null,null,null,null,null,null,null,null,null,null,null,null,null,null,null,null,null,null,null,null,null,null,null,null,null,null,"8M37",1,5,3,7,2]
[null,null,null,null,null,null,null,null,null,null,null,null,null,null,null,null,null,null,null,null,null,null,null,null,null,null,null,null,null,null,null,null,null,null,null,null,null,null,null,null,null,null,null,"8M38",1,6,3,8,2]
[null,null,null,null,null,null,null,null,null,null,null,null,null,null,null,null,null,null,null,null,null,null,null,null,null,null,null,null,null,null,null,null,null,null,null,null,null,null,null,null,null,null,null,"8M39",1,7,3,1,2]
[null,null,null,null,null,null,null,null,null,null,null,null,null,null,null,null,null,null,null,null,null,null,null,null,null,null,null,null,null,null,null,null,null,null,null,null,null,null,null,null,null,null,null,"8M40",1,8,3,2,2]
[null,null,null,null,null,null,null,null,null,null,null,null,null,null,null,null,null,null,null,null,null,null,null,null,null,null,null,null,null,null,null,null,null,null,null,null,null,null,null,null,null,null,null,"8M41",1,1,2,2,2]
[null,null,null,null,null,null,null,null,null,null,null,null,null,null,null,null,null,null,null,null,null,null,null,null,null,null,null,null,null,null,null,null,null,null,null,null,null,null,null,null,null,null,null,"8M42",1,2,2,3,2]
[null,null,null,null,null,null,null,null,null,null,null,null,null,null,null,null,null,null,null,null,null,null,null,null,null,null,null,null,null,null,null,null,null,null,null,null,null,null,null,null,null,null,null,"8M43",1,3,2,4,2]
[null,null,null,null,null,null,null,null,null,null,null,null,null,null,null,null,null,null,null,null,null,null,null,null,null,null,null,null,null,null,null,null,null,null,null,null,null,null,null,null,null,null,null,"8M44",1,4,2,5,2]
[null,null,null,null,null,null,null,null,null,null,null,null,null,null,null,null,null,null,null,null,null,null,null,null,null,null,null,null,null,null,null,null,null,null,null,null,null,null,null,null,null,null,null,"8M45",1,5,2,6,2]
[null,null,null,null,null,null,null,null,null,null,null,null,null,null,null,null,null,null,null,null,null,null,null,null,null,null,null,null,null,null,null,null,null,null,null,null,null,null,null,null,null,null,null,"8M46",1,6,2,7,2]
[null,null,null,null,null,null,null,null,null,null,null,null,null,null,null,null,null,null,null,null,null,null,null,null,null,null,null,null,null,null,null,null,null,null,null,null,null,null,null,null,null,null,null,"8M47",1,7,2,8,2]
[null,null,null,null,null,null,null,null,null,null,null,null,null,null,null,null,null,null,null,null,null,null,null,null,null,null,null,null,null,null,null,null,null,null,null,null,null,null,null,null,null,null,null,"8M48",1,8,2,1,2]
[null,null,null,null,null,null,null,null,null,null,null,null,null,null,null,null,null,null,null,null,null,null,null,null,null,null,null,null,null,null,null,null,null,null,null,null,null,null,null,null,null,null,null,"8M49",2,3,3,5,3]
[null,null,null,null,null,null,null,null,null,null,null,null,null,null,null,null,null,null,null,null,null,null,null,null,null,null,null,null,null,null,null,null,null,null,null,null,null,null,null,null,null,null,null,"8M50",2,4,3,6,3]
[null,null,null,null,null,null,null,null,null,null,null,null,null,null,null,null,null,null,null,null,null,null,null,null,null,null,null,null,null,null,null,null,null,null,null,null,null,null,null,null,null,null,null,"8M51",2,5,3,7,3]
[null,null,null,null,null,null,null,null,null,null,null,null,null,null,null,null,null,null,null,null,null,null,null,null,null,null,null,null,null,null,null,null,null,null,null,null,null,null,null,null,null,null,null,"8M52",2,6,3,8,3]
[null,null,null,null,null,null,null,null,null,null,null,null,null,null,null,null,null,null,null,null,null,null,null,null,null,null,null,null,null,null,null,null,null,null,null,null,null,null,null,null,null,null,null,"8M53",2,7,3,1,3]
[null,null,null,null,null,null,null,null,null,null,null,null,null,null,null,null,null,null,null,null,null,null,null,null,null,null,null,null,null,null,null,null,null,null,null,null,null,null,null,null,null,null,null,"8M54",2,8,3,2,3]
[null,null,null,null,null,null,null,null,null,null,null,null,null,null,null,null,null,null,null,null,null,null,null,null,null,null,null,null,null,null,null,null,null,null,null,null,null,null,null,null,null,null,null,"8M55",2,1,3,3,3]
[null,null,null,null,null,null,null,null,null,null,null,null,null,null,null,null,null,null,null,null,null,null,null,null,null,null,null,null,null,null,null,null,null,null,null,null,null,null,null,null,null,null,null,"8M56",2,2,3,4,3]
[null,null,null,null,null,null,null,null,null,null,null,null,null,null,null,null,null,null,null,null,null,null,null,null,null,null,null,null,null,null,null,null,null,null,null,null,null,null,null,null,null,null,null,"8M57",1,1,3,5,3]
[null,null,null,null,null,null,null,null,null,null,null,null,null,null,null,null,null,null,null,null,null,null,null,null,null,null,null,null,null,null,null,null,null,null,null,null,null,null,null,null,null,null,null,"8M58",1,2,3,6,3]
[null,null,null,null,null,null,null,null,null,null,null,null,null,null,null,null,null,null,null,null,null,null,null,null,null,null,null,null,null,null,null,null,null,null,null,null,null,null,null,null,null,null,null,"8M59",1,3,3,7,3]
[null,null,null,null,null,null,null,null,null,null,null,null,null,null,null,null,null,null,null,null,null,null,null,null,null,null,null,null,null,null,null,null,null,null,null,null,null,null,null,null,null,null,null,"8M60",1,4,3,8,3]
[null,null,null,null,null,null,null,null,null,null,null,null,null,null,null,null,null,null,null,null,null,null,null,null,null,null,null,null,null,null,null,null,null,null,null,null,null,null,null,null,null,null,null,"8M61",1,5,3,1,3]
[null,null,null,null,null,null,null,null,null,null,null,null,null,null,null,null,null,null,null,null,null,null,null,null,null,null,null,null,null,null,null,null,null,null,null,null,null,null,null,null,null,null,null,"8M62",1,6,3,2,3]
[null,null,null,null,null,null,null,null,null,null,null,null,null,null,null,null,null,null,null,null,null,null,null,null,null,null,null,null,null,null,null,null,null,null,null,null,null,null,null,null,null,null,null,"8M63",1,7,3,3,3]
[null,null,null,null,null,null,null,null,null,null,null,null,null,null,null,null,null,null,null,null,null,null,null,null,null,null,null,null,null,null,null,null,null,null,null,null,null,null,null,null,null,null,null,"8M64",1,8,3,4,3]
[null,null,null,null,null,null,null,null,null,null,null,null,null,null,null,null,null,null,null,null,null,null,null,null,null,null,null,null,null,null,null,null,null,null,null,null,null,null,null,null,null,null,null,"8M65",1,1,2,3,3]
[null,null,null,null,null,null,null,null,null,null,null,null,null,null,null,null,null,null,null,null,null,null,null,null,null,null,null,null,null,null,null,null,null,null,null,null,null,null,null,null,null,null,null,"8M66",1,2,2,4,3]
[null,null,null,null,null,null,null,null,null,null,null,null,null,null,null,null,null,null,null,null,null,null,null,null,null,null,null,null,null,null,null,null,null,null,null,null,null,null,null,null,null,null,null,"8M67",1,3,2,5,3]
[null,null,null,null,null,null,null,null,null,null,null,null,null,null,null,null,null,null,null,null,null,null,null,null,null,null,null,null,null,null,null,null,null,null,null,null,null,null,null,null,null,null,null,"8M68",1,4,2,6,3]
[null,null,null,null,null,null,null,null,null,null,null,null,null,null,null,null,null,null,null,null,null,null,null,null,null,null,null,null,null,null,null,null,null,null,null,null,null,null,null,null,null,null,null,"8M69",1,5,2,7,3]
[null,null,null,null,null,null,null,null,null,null,null,null,null,null,null,null,null,null,null,null,null,null,null,null,null,null,null,null,null,null,null,null,null,null,null,null,null,null,null,null,null,null,null,"8M70",1,6,2,8,3]
[null,null,null,null,null,null,null,null,null,null,null,null,null,null,null,null,null,null,null,null,null,null,null,null,null,null,null,null,null,null,null,null,null,null,null,null,null,null,null,null,null,null,null,"8M71",1,7,2,1,3]
[null,null,null,null,null,null,null,null,null,null,null,null,null,null,null,null,null,null,null,null,null,null,null,null,null,null,null,null,null,null,null,null,null,null,null,null,null,null,null,null,null,null,null,"8M72",1,8,2,2,3]

{"sheet":"【準備】対戦カード","index":1,"n_rows":105,"n_cols":72,"rows_kept":105,"cut":false,"hidden":false,"merged":[]}
[null,null,null,null,null,null,null,null,null," ",{"$f":"【結果】個人成績表!$A$1","v":"第9回　神奈滋対抗戦　　　(奈良；キングスポット)"}]
[]
[null,"印刷範囲の設定",null,null,null,null,null,null,null,null,"G-No",null,null,null,"T-No"]
[]
[null,null,null,null,null,null,null,null,null,null,null,null,null,"所属"]
[null,null,null,null,null,null,null,null,null,null,null,null,null,"氏名"]
[null,null,null,null,null,null,null,null,null,null,null,null,null,"得点"]
[null,null,null,null,null,null,null,null,null,null,null,null,null,"HR"]
[]
[null,null,null,null,null,null,null,null,null,null,null,null,null,null,"レフリー"]
[null,{"$f":"【結果】個人成績表!$A$1","v":"第9回　神奈滋対抗戦　　　(奈良；キングスポット)"},null,null,null,null,null,null,null,null,{"$f":"【結果】個人成績表!$A$1","v":"第9回　神奈滋対抗戦　　　(奈良；キングスポット)"},null,null,null,null,null,null,null,null,{"$f":"【結果】個人成績表!$A$1","v":"第9回　神奈滋対抗戦　　　(奈良；キングスポット)"},null,null,null,null,null,null,null,null,{"$f":"【結果】個人成績表!$A$1","v":"第9回　神奈滋対抗戦　　　(奈良；キングスポット)"},null,null,null,null,null,null,null,null,{"$f":"【結果】個人成績表!$A$1","v":"第9回　神奈滋対抗戦　　　(奈良；キングスポット)"},null,null,null,null,null,null,null,null,{"$f":"【結果】個人成績表!$A$1","v":"第9回　神奈滋対抗戦　　　(奈良；キングスポット)"},null,null,null,null,null,null,null,null,{"$f":"【結果】個人成績表!$A$1","v":"第9回　神奈滋対抗戦　　　(奈良；キングスポット)"},null,null,null,null,null,null,null,null,{"$f":"【結果】個人成績表!$A$1","v":"第9回　神奈滋対抗戦　　　(奈良；キングスポット)"},null,null,null,null,null,null," "]
[]
[null,"G-No",{"$f":"【進行】結果入力表!B7","v":1},null,null,"T-No",null,null,null,null,"G-No",{"$f":"【進行】結果入力表!B8","v":2},null,null,"T-No",null,null,null,null,"G-No",{"$f":"【進行】結果入力表!B9","v":3},null,null,"T-No",null,null,null,null,"G-No",{"$f":"【進行】結果入力表!B10","v":4},null,null,"T-No",null,null,null,null,"G-No",{"$f":"【進行】結果入力表!B11","v":5},null,null,"T-No",null,null,null,null,"G-No",{"$f":"【進行】結果入力表!B12","v":6},null,null,"T-No",null,null,null,null,"G-No",{"$f":"【進行】結果入力表!B13","v":7},null,null,"T-No",null,null,null,null,"G-No",{"$f":"【進行】結果入力表!B14","v":8},null,null,"T-No"]
[]
[null,{"$f":"VLOOKUP(C13,【進行】結果入力表!$B$7:$J$78,2,FALSE)","v":"HRC"},null,null,"所属",{"$f":"VLOOKUP(C13,【進行】結果入力表!$B$7:$J$78,9,FALSE)","v":"SBC"},null,null,null,null,{"$f":"VLOOKUP(L13,【進行】結果入力表!$B$7:$J$78,2,FALSE)","v":"HRC"},null,null,"所属",{"$f":"VLOOKUP(L13,【進行】結果入力表!$B$7:$J$78,9,FALSE)","v":"SBC"},null,null,null,null,{"$f":"VLOOKUP(U13,【進行】結果入力表!$B$7:$J$78,2,FALSE)","v":"HRC"},null,null,"所属",{"$f":"VLOOKUP(U13,【進行】結果入力表!$B$7:$J$78,9,FALSE)","v":"SBC"},null,null,null,null,{"$f":"VLOOKUP(AD13,【進行】結果入力表!$B$7:$J$78,2,FALSE)","v":"HRC"},null,null,"所属",{"$f":"VLOOKUP(AD13,【進行】結果入力表!$B$7:$J$78,9,FALSE)","v":"SBC"},null,null,null,null,{"$f":"VLOOKUP(AM13,【進行】結果入力表!$B$7:$J$78,2,FALSE)","v":"HRC"},null,null,"所属",{"$f":"VLOOKUP(AM13,【進行】結果入力表!$B$7:$J$78,9,FALSE)","v":"SBC"},null,null,null,null,{"$f":"VLOOKUP(AV13,【進行】結果入力表!$B$7:$J$78,2,FALSE)","v":"HRC"},null,null,"所属",{"$f":"VLOOKUP(AV13,【進行】結果入力表!$B$7:$J$78,9,FALSE)","v":"SBC"},null,null,null,null,{"$f":"VLOOKUP(BE13,【進行】結果入力表!$B$7:$J$78,2,FALSE)","v":"NRC"},null,null,"所属",{"$f":"VLOOKUP(BE13,【進行】結果入力表!$B$7:$J$78,9,FALSE)","v":"SBC"},null,null,null,null,{"$f":"VLOOKUP(BN13,【進行】結果入力表!$B$7:$J$78,2,FALSE)","v":"NRC"},null,null,"所属",{"$f":"VLOOKUP(BN13,【進行】結果入力表!$B$7:$J$78,9,FALSE)","v":"SBC"}]
[null,{"$f":"VLOOKUP(C13,【進行】結果入力表!$B$7:$J$78,3,FALSE)","v":"高木　俊行"},null,null,"氏名",{"$f":"VLOOKUP(C13,【進行】結果入力表!$B$7:$J$78,8,FALSE)","v":"林　秀忠"},null,null,null,null,{"$f":"VLOOKUP(L13,【進行】結果入力表!$B$7:$J$78,3,FALSE)","v":"金井　健太郎"},null,null,"氏名",{"$f":"VLOOKUP(L13,【進行】結果入力表!$B$7:$J$78,8,FALSE)","v":"秋田　倫央"},null,null,null,null,{"$f":"VLOOKUP(U13,【進行】結果入力表!$B$7:$J$78,3,FALSE)","v":"平井　洸志"},null,null,"氏名",{"$f":"VLOOKUP(U13,【進行】結果入力表!$B$7:$J$78,8,FALSE)","v":"大橋　正寛"},null,null,null,null,{"$f":"VLOOKUP(AD13,【進行】結果入力表!$B$7:$J$78,3,FALSE)","v":"中尾　亮太"},null,null,"氏名",{"$f":"VLOOKUP(AD13,【進行】結果入力表!$B$7:$J$78,8,FALSE)","v":"大橋　義治"},null,null,null,null,{"$f":"VLOOKUP(AM13,【進行】結果入力表!$B$7:$J$78,3,FALSE)","v":"宮本　一"},null,null,"氏名",{"$f":"VLOOKUP(AM13,【進行】結果入力表!$B$7:$J$78,8,FALSE)","v":"山中　康寛"},null,null,null,null,{"$f":"VLOOKUP(AV13,【進行】結果入力表!$B$7:$J$78,3,FALSE)","v":"河地　恵里"},null,null,"氏名",{"$f":"VLOOKUP(AV13,【進行】結果入力表!$B$7:$J$78,8,FALSE)","v":"大橋　洋子"},null,null,null,null,{"$f":"VLOOKUP(BE13,【進行】結果入力表!$B$7:$J$78,3,FALSE)","v":"岩本　剛"},null,null,"氏名",{"$f":"VLOOKUP(BE13,【進行】結果入力表!$B$7:$J$78,8,FALSE)","v":"林　秀忠"},null,null,null,null,{"$f":"VLOOKUP(BN13,【進行】結果入力表!$B$7:$J$78,3,FALSE)","v":"吉向　翔平"},null,null,"氏名",{"$f":"VLOOKUP(BN13,【進行】結果入力表!$B$7:$J$78,8,FALSE)","v":"秋田　倫央"}]
[null,null,null,null,"得点",null,null,null,null,null,null,null,null,"得点",null,null,null,null,null,null,null,null,"得点",null,null,null,null,null,null,null,null,"得点",null,null,null,null,null,null,null,null,"得点",null,null,null,null,null,null,null,null,"得点",null,null,null,null,null,null,null,null,"得点",null,null,null,null,null,null,null,null,"得点"]
[null,null,null,null,"HR",null,null,null,null,null,null,null,null,"HR",null,null,null,null,null,null,null,null,"HR",null,null,null,null,null,null,null,null,"HR",null,null,null,null,null,null,null,null,"HR",null,null,null,null,null,null,null,null,"HR",null,null,null,null,null,null,null,null,"HR",null,null,null,null,null,null,null,null,"HR"]
[]
[null,null,null,null,"レフリー：",{"$f":"VLOOKUP(C13,【進行】結果入力表!$B$7:$M$78,11,FALSE)","v":"NRC"},{"$f":"VLOOKUP(C13,【進行】結果入力表!$B$7:$M$78,12,FALSE)","v":"岩本　剛"},null,null,null,null,null,null,"レフリー：",{"$f":"VLOOKUP(L13,【進行】結果入力表!$B$7:$M$78,11,FALSE)","v":"NRC"},{"$f":"VLOOKUP(L13,【進行】結果入力表!$B$7:$M$78,12,FALSE)","v":"吉向　翔平"},null,null,null,null,null,null,"レフリー：",{"$f":"VLOOKUP(U13,【進行】結果入力表!$B$7:$M$78,11,FALSE)","v":"NRC"},{"$f":"VLOOKUP(U13,【進行】結果入力表!$B$7:$M$78,12,FALSE)","v":"金澤　茂昌"},null,null,null,null,null,null,"レフリー：",{"$f":"VLOOKUP(AD13,【進行】結果入力表!$B$7:$M$78,11,FALSE)","v":"NRC"},{"$f":"VLOOKUP(AD13,【進行】結果入力表!$B$7:$M$78,12,FALSE)","v":"植田　慎也"},null,null,null,null,null,null,"レフリー：",{"$f":"VLOOKUP(AM13,【進行】結果入力表!$B$7:$M$78,11,FALSE)","v":"NRC"},{"$f":"VLOOKUP(AM13,【進行】結果入力表!$B$7:$M$78,12,FALSE)","v":"長谷川　進"},null,null,null,null,null,null,"レフリー：",{"$f":"VLOOKUP(AV13,【進行】結果入力表!$B$7:$M$78,11,FALSE)","v":"NRC"},{"$f":"VLOOKUP(AV13,【進行】結果入力表!$B$7:$M$78,12,FALSE)","v":"宮野　早織"},null,null,null,null,null,null,"レフリー：",{"$f":"VLOOKUP(BE13,【進行】結果入力表!$B$7:$M$78,11,FALSE)","v":"HRC"},{"$f":"VLOOKUP(BE13,【進行】結果入力表!$B$7:$M$78,12,FALSE)","v":"高木　俊行"},null,null,null,null,null,null,"レフリー：",{"$f":"VLOOKUP(BN13,【進行】結果入力表!$B$7:$M$78,11,FALSE)","v":"HRC"},{"$f":"VLOOKUP(BN13,【進行】結果入力表!$B$7:$M$78,12,FALSE)","v":"金井　健太郎"}]
[null,{"$f":"【結果】個人成績表!$A$1","v":"第9回　神奈滋対抗戦　　　(奈良；キングスポット)"},null,null,null,null,null,null,null,null,{"$f":"【結果】個人成績表!$A$1","v":"第9回　神奈滋対抗戦　　　(奈良；キングスポット)"},null,null,null,null,null,null,null,null,{"$f":"【結果】個人成績表!$A$1","v":"第9回　神奈滋対抗戦　　　(奈良；キングスポット)"},null,null,null,null,null,null,null,null,{"$f":"【結果】個人成績表!$A$1","v":"第9回　神奈滋対抗戦　　　(奈良；キングスポット)"},null,null,null,null,null,null,null,null,{"$f":"【結果】個人成績表!$A$1","v":"第9回　神奈滋対抗戦　　　(奈良；キングスポット)"},null,null,null,null,null,null,null,null,{"$f":"【結果】個人成績表!$A$1","v":"第9回　神奈滋対抗戦　　　(奈良；キングスポット)"},null,null,null,null,null,null,null,null,{"$f":"【結果】個人成績表!$A$1","v":"第9回　神奈滋対抗戦　　　(奈良；キングスポット)"},null,null,null,null,null,null,null,null,{"$f":"【結果】個人成績表!$A$1","v":"第9回　神奈滋対抗戦　　　(奈良；キングスポット)"},null,null,null,null,null,null," "]
[]
[null,"G-No",{"$f":"【進行】結果入力表!B15","v":9},null,null,"T-No",null,null,null,null,"G-No",{"$f":"【進行】結果入力表!B16","v":10},null,null,"T-No",null,null,null,null,"G-No",{"$f":"【進行】結果入力表!B17","v":11},null,null,"T-No",null,null,null,null,"G-No",{"$f":"【進行】結果入力表!B18","v":12},null,null,"T-No",null,null,null,null,"G-No",{"$f":"【進行】結果入力表!B19","v":13},null,null,"T-No",null,null,null,null,"G-No",{"$f":"【進行】結果入力表!B20","v":14},null,null,"T-No",null,null,null,null,"G-No",{"$f":"【進行】結果入力表!B21","v":15},null,null,"T-No",null,null,null,null,"G-No",{"$f":"【進行】結果入力表!B22","v":16},null,null,"T-No"]
[]
[null,{"$f":"VLOOKUP(C23,【進行】結果入力表!$B$7:$J$78,2,FALSE)","v":"NRC"},null,null,"所属",{"$f":"VLOOKUP(C23,【進行】結果入力表!$B$7:$J$78,9,FALSE)","v":"SBC"},null,null,null,null,{"$f":"VLOOKUP(L23,【進行】結果入力表!$B$7:$J$78,2,FALSE)","v":"NRC"},null,null,"所属",{"$f":"VLOOKUP(L23,【進行】結果入力表!$B$7:$J$78,9,FALSE)","v":"SBC"},null,null,null,null,{"$f":"VLOOKUP(U23,【進行】結果入力表!$B$7:$J$78,2,FALSE)","v":"NRC"},null,null,"所属",{"$f":"VLOOKUP(U23,【進行】結果入力表!$B$7:$J$78,9,FALSE)","v":"SBC"},null,null,null,null,{"$f":"VLOOKUP(AD23,【進行】結果入力表!$B$7:$J$78,2,FALSE)","v":"NRC"},null,null,"所属",{"$f":"VLOOKUP(AD23,【進行】結果入力表!$B$7:$J$78,9,FALSE)","v":"SBC"},null,null,null,null,{"$f":"VLOOKUP(AM23,【進行】結果入力表!$B$7:$J$78,2,FALSE)","v":"NRC"},null,null,"所属",{"$f":"VLOOKUP(AM23,【進行】結果入力表!$B$7:$J$78,9,FALSE)","v":"HRC"},null,null,null,null,{"$f":"VLOOKUP(AV23,【進行】結果入力表!$B$7:$J$78,2,FALSE)","v":"NRC"},null,null,"所属",{"$f":"VLOOKUP(AV23,【進行】結果入力表!$B$7:$J$78,9,FALSE)","v":"HRC"},null,null,null,null,{"$f":"VLOOKUP(BE23,【進行】結果入力表!$B$7:$J$78,2,FALSE)","v":"NRC"},null,null,"所属",{"$f":"VLOOKUP(BE23,【進行】結果入力表!$B$7:$J$78,9,FALSE)","v":"HRC"},null,null,null,null,{"$f":"VLOOKUP(BN23,【進行】結果入力表!$B$7:$J$78,2,FALSE)","v":"NRC"},null,null,"所属",{"$f":"VLOOKUP(BN23,【進行】結果入力表!$B$7:$J$78,9,FALSE)","v":"HRC"}]
[null,{"$f":"VLOOKUP(C23,【進行】結果入力表!$B$7:$J$78,3,FALSE)","v":"金澤　茂昌"},null,null,"氏名",{"$f":"VLOOKUP(C23,【進行】結果入力表!$B$7:$J$78,8,FALSE)","v":"大橋　正寛"},null,null,null,null,{"$f":"VLOOKUP(L23,【進行】結果入力表!$B$7:$J$78,3,FALSE)","v":"植田　慎也"},null,null,"氏名",{"$f":"VLOOKUP(L23,【進行】結果入力表!$B$7:$J$78,8,FALSE)","v":"大橋　義治"},null,null,null,null,{"$f":"VLOOKUP(U23,【進行】結果入力表!$B$7:$J$78,3,FALSE)","v":"長谷川　進"},null,null,"氏名",{"$f":"VLOOKUP(U23,【進行】結果入力表!$B$7:$J$78,8,FALSE)","v":"山中　康寛"},null,null,null,null,{"$f":"VLOOKUP(AD23,【進行】結果入力表!$B$7:$J$78,3,FALSE)","v":"宮野　早織"},null,null,"氏名",{"$f":"VLOOKUP(AD23,【進行】結果入力表!$B$7:$J$78,8,FALSE)","v":"大橋　洋子"},null,null,null,null,{"$f":"VLOOKUP(AM23,【進行】結果入力表!$B$7:$J$78,3,FALSE)","v":"岩本　剛"},null,null,"氏名",{"$f":"VLOOKUP(AM23,【進行】結果入力表!$B$7:$J$78,8,FALSE)","v":"高木　俊行"},null,null,null,null,{"$f":"VLOOKUP(AV23,【進行】結果入力表!$B$7:$J$78,3,FALSE)","v":"吉向　翔平"},null,null,"氏名",{"$f":"VLOOKUP(AV23,【進行】結果入力表!$B$7:$J$78,8,FALSE)","v":"金井　健太郎"},null,null,null,null,{"$f":"VLOOKUP(BE23,【進行】結果入力表!$B$7:$J$78,3,FALSE)","v":"金澤　茂昌"},null,null,"氏名",{"$f":"VLOOKUP(BE23,【進行】結果入力表!$B$7:$J$78,8,FALSE)","v":"平井　洸志"},null,null,null,null,{"$f":"VLOOKUP(BN23,【進行】結果入力表!$B$7:$J$78,3,FALSE)","v":"植田　慎也"},null,null,"氏名",{"$f":"VLOOKUP(BN23,【進行】結果入力表!$B$7:$J$78,8,FALSE)","v":"中尾　亮太"}]
[null,null,null,null,"得点",null,null,null,null,null,null,null,null,"得点",null,null,null,null,null,null,null,null,"得点",null,null,null,null,null,null,null,null,"得点",null,null,null,null,null,null,null,null,"得点",null,null,null,null,null,null,null,null,"得点",null,null,null,null,null,null,null,null,"得点",null,null,null,null,null,null,null,null,"得点"]
[null,null,null,null,"HR",null,null,null,null,null,null,null,null,"HR",null,null,null,null,null,null,null,null,"HR",null,null,null,null,null,null,null,null,"HR",null,null,null,null,null,null,null,null,"HR",null,null,null,null,null,null,null,null,"HR",null,null,null,null,null,null,null,null,"HR",null,null,null,null,null,null,null,null,"HR"]
[]
[null,null,null,null,"レフリー：",{"$f":"VLOOKUP(C23,【進行】結果入力表!$B$7:$M$78,11,FALSE)","v":"HRC"},{"$f":"VLOOKUP(C23,【進行】結果入力表!$B$7:$M$78,12,FALSE)","v":"平井　洸志"},null,null,null,null,null,null,"レフリー：",{"$f":"VLOOKUP(L23,【進行】結果入力表!$B$7:$M$78,11,FALSE)","v":"HRC"},{"$f":"VLOOKUP(L23,【進行】結果入力表!$B$7:$M$78,12,FALSE)","v":"中尾　亮太"},null,null,null,null,null,null,"レフリー：",{"$f":"VLOOKUP(U23,【進行】結果入力表!$B$7:$M$78,11,FALSE)","v":"HRC"},{"$f":"VLOOKUP(U23,【進行】結果入力表!$B$7:$M$78,12,FALSE)","v":"宮本　一"},null,null,null,null,null,null,"レフリー：",{"$f":"VLOOKUP(AD23,【進行】結果入力表!$B$7:$M$78,11,FALSE)","v":"HRC"},{"$f":"VLOOKUP(AD23,【進行】結果入力表!$B$7:$M$78,12,FALSE)","v":"河地　恵里"},null,null,null,null,null,null,"レフリー：",{"$f":"VLOOKUP(AM23,【進行】結果入力表!$B$7:$M$78,11,FALSE)","v":"SBC"},{"$f":"VLOOKUP(AM23,【進行】結果入力表!$B$7:$M$78,12,FALSE)","v":"林　秀忠"},null,null,null,null,null,null,"レフリー：",{"$f":"VLOOKUP(AV23,【進行】結果入力表!$B$7:$M$78,11,FALSE)","v":"SBC"},{"$f":"VLOOKUP(AV23,【進行】結果入力表!$B$7:$M$78,12,FALSE)","v":"秋田　倫央"},null,null,null,null,null,null,"レフリー：",{"$f":"VLOOKUP(BE23,【進行】結果入力表!$B$7:$M$78,11,FALSE)","v":"SBC"},{"$f":"VLOOKUP(BE23,【進行】結果入力表!$B$7:$M$78,12,FALSE)","v":"大橋　正寛"},null,null,null,null,null,null,"レフリー：",{"$f":"VLOOKUP(BN23,【進行】結果入力表!$B$7:$M$78,11,FALSE)","v":"SBC"},{"$f":"VLOOKUP(BN23,【進行】結果入力表!$B$7:$M$78,12,FALSE)","v":"大橋　義治"}]
[null,{"$f":"【結果】個人成績表!$A$1","v":"第9回　神奈滋対抗戦　　　(奈良；キングスポット)"},null,null,null,null,null,null,null,null,{"$f":"【結果】個人成績表!$A$1","v":"第9回　神奈滋対抗戦　　　(奈良；キングスポット)"},null,null,null,null,null,null,null,null,{"$f":"【結果】個人成績表!$A$1","v":"第9回　神奈滋対抗戦　　　(奈良；キングスポット)"},null,null,null,null,null,null,null,null,{"$f":"【結果】個人成績表!$A$1","v":"第9回　神奈滋対抗戦　　　(奈良；キングスポット)"},null,null,null,null,null,null,null,null,{"$f":"【結果】個人成績表!$A$1","v":"第9回　神奈滋対抗戦　　　(奈良；キングスポット)"},null,null,null,null,null,null,null,null,{"$f":"【結果】個人成績表!$A$1","v":"第9回　神奈滋対抗戦　　　(奈良；キングスポット)"},null,null,null,null,null,null,null,null,{"$f":"【結果】個人成績表!$A$1","v":"第9回　神奈滋対抗戦　　　(奈良；キングスポット)"},null,null,null,null,null,null,null,null,{"$f":"【結果】個人成績表!$A$1","v":"第9回　神奈滋対抗戦　　　(奈良；キングスポット)"},null,null,null,null,null,null," "]
[]
[null,"G-No",{"$f":"【進行】結果入力表!B23","v":17},null,null,"T-No",null,null,null,null,"G-No",{"$f":"【進行】結果入力表!B24","v":18},null,null,"T-No",null,null,null,null,"G-No",{"$f":"【進行】結果入力表!B25","v":19},null,null,"T-No",null,null,null,null,"G-No",{"$f":"【進行】結果入力表!B26","v":20},null,null,"T-No",null,null,null,null,"G-No",{"$f":"【進行】結果入力表!B27","v":21},null,null,"T-No",null,null,null,null,"G-No",{"$f":"【進行】結果入力表!B28","v":22},null,null,"T-No",null,null,null,null,"G-No",{"$f":"【進行】結果入力表!B29","v":23},null,null,"T-No",null,null,null,null,"G-No",{"$f":"【進行】結果入力表!B30","v":24},null,null,"T-No"]
[]
[null,{"$f":"VLOOKUP(C33,【進行】結果入力表!$B$7:$J$78,2,FALSE)","v":"NRC"},null,null,"所属",{"$f":"VLOOKUP(C33,【進行】結果入力表!$B$7:$J$78,9,FALSE)","v":"HRC"},null,null,null,null,{"$f":"VLOOKUP(L33,【進行】結果入力表!$B$7:$J$78,2,FALSE)","v":"NRC"},null,null,"所属",{"$f":"VLOOKUP(L33,【進行】結果入力表!$B$7:$J$78,9,FALSE)","v":"HRC"},null,null,null,null,{"$f":"VLOOKUP(U33,【進行】結果入力表!$B$7:$J$78,2,FALSE)","v":"HRC"},null,null,"所属",{"$f":"VLOOKUP(U33,【進行】結果入力表!$B$7:$J$78,9,FALSE)","v":"SBC"},null,null,null,null,{"$f":"VLOOKUP(AD33,【進行】結果入力表!$B$7:$J$78,2,FALSE)","v":"HRC"},null,null,"所属",{"$f":"VLOOKUP(AD33,【進行】結果入力表!$B$7:$J$78,9,FALSE)","v":"SBC"},null,null,null,null,{"$f":"VLOOKUP(AM33,【進行】結果入力表!$B$7:$J$78,2,FALSE)","v":"HRC"},null,null,"所属",{"$f":"VLOOKUP(AM33,【進行】結果入力表!$B$7:$J$78,9,FALSE)","v":"SBC"},null,null,null,null,{"$f":"VLOOKUP(AV33,【進行】結果入力表!$B$7:$J$78,2,FALSE)","v":"HRC"},null,null,"所属",{"$f":"VLOOKUP(AV33,【進行】結果入力表!$B$7:$J$78,9,FALSE)","v":"SBC"},null,null,null,null,{"$f":"VLOOKUP(BE33,【進行】結果入力表!$B$7:$J$78,2,FALSE)","v":"HRC"},null,null,"所属",{"$f":"VLOOKUP(BE33,【進行】結果入力表!$B$7:$J$78,9,FALSE)","v":"SBC"},null,null,null,null,{"$f":"VLOOKUP(BN33,【進行】結果入力表!$B$7:$J$78,2,FALSE)","v":"HRC"},null,null,"所属",{"$f":"VLOOKUP(BN33,【進行】結果入力表!$B$7:$J$78,9,FALSE)","v":"SBC"}]
[null,{"$f":"VLOOKUP(C33,【進行】結果入力表!$B$7:$J$78,3,FALSE)","v":"長谷川　進"},null,null,"氏名",{"$f":"VLOOKUP(C33,【進行】結果入力表!$B$7:$J$78,8,FALSE)","v":"宮本　一"},null,null,null,null,{"$f":"VLOOKUP(L33,【進行】結果入力表!$B$7:$J$78,3,FALSE)","v":"宮野　早織"},null,null,"氏名",{"$f":"VLOOKUP(L33,【進行】結果入力表!$B$7:$J$78,8,FALSE)","v":"河地　恵里"},null,null,null,null,{"$f":"VLOOKUP(U33,【進行】結果入力表!$B$7:$J$78,3,FALSE)","v":"金井　健太郎"},null,null,"氏名",{"$f":"VLOOKUP(U33,【進行】結果入力表!$B$7:$J$78,8,FALSE)","v":"大橋　正寛"},null,null,null,null,{"$f":"VLOOKUP(AD33,【進行】結果入力表!$B$7:$J$78,3,FALSE)","v":"平井　洸志"},null,null,"氏名",{"$f":"VLOOKUP(AD33,【進行】結果入力表!$B$7:$J$78,8,FALSE)","v":"大橋　義治"},null,null,null,null,{"$f":"VLOOKUP(AM33,【進行】結果入力表!$B$7:$J$78,3,FALSE)","v":"中尾　亮太"},null,null,"氏名",{"$f":"VLOOKUP(AM33,【進行】結果入力表!$B$7:$J$78,8,FALSE)","v":"山中　康寛"},null,null,null,null,{"$f":"VLOOKUP(AV33,【進行】結果入力表!$B$7:$J$78,3,FALSE)","v":"宮本　一"},null,null,"氏名",{"$f":"VLOOKUP(AV33,【進行】結果入力表!$B$7:$J$78,8,FALSE)","v":"大橋　洋子"},null,null,null,null,{"$f":"VLOOKUP(BE33,【進行】結果入力表!$B$7:$J$78,3,FALSE)","v":"河地　恵里"},null,null,"氏名",{"$f":"VLOOKUP(BE33,【進行】結果入力表!$B$7:$J$78,8,FALSE)","v":"林　秀忠"},null,null,null,null,{"$f":"VLOOKUP(BN33,【進行】結果入力表!$B$7:$J$78,3,FALSE)","v":"高木　俊行"},null,null,"氏名",{"$f":"VLOOKUP(BN33,【進行】結果入力表!$B$7:$J$78,8,FALSE)","v":"秋田　倫央"}]
[null,null,null,null,"得点",null,null,null,null,null,null,null,null,"得点",null,null,null,null,null,null,null,null,"得点",null,null,null,null,null,null,null,null,"得点",null,null,null,null,null,null,null,null,"得点",null,null,null,null,null,null,null,null,"得点",null,null,null,null,null,null,null,null,"得点",null,null,null,null,null,null,null,null,"得点"]
[null,null,null,null,"HR",null,null,null,null,null,null,null,null,"HR",null,null,null,null,null,null,null,null,"HR",null,null,null,null,null,null,null,null,"HR",null,null,null,null,null,null,null,null,"HR",null,null,null,null,null,null,null,null,"HR",null,null,null,null,null,null,null,null,"HR",null,null,null,null,null,null,null,null,"HR"]
[]
[null,null,null,null,"レフリー：",{"$f":"VLOOKUP(C33,【進行】結果入力表!$B$7:$M$78,11,FALSE)","v":"SBC"},{"$f":"VLOOKUP(C33,【進行】結果入力表!$B$7:$M$78,12,FALSE)","v":"山中　康寛"},null,null,null,null,null,null,"レフリー：",{"$f":"VLOOKUP(L33,【進行】結果入力表!$B$7:$M$78,11,FALSE)","v":"SBC"},{"$f":"VLOOKUP(L33,【進行】結果入力表!$B$7:$M$78,12,FALSE)","v":"大橋　洋子"},null,null,null,null,null,null,"レフリー：",{"$f":"VLOOKUP(U33,【進行】結果入力表!$B$7:$M$78,11,FALSE)","v":0},{"$f":"VLOOKUP(U33,【進行】結果入力表!$B$7:$M$78,12,FALSE)","v":0},null,null,null,null,null,null,"レフリー：",{"$f":"VLOOKUP(AD33,【進行】結果入力表!$B$7:$M$78,11,FALSE)","v":0},{"$f":"VLOOKUP(AD33,【進行】結果入力表!$B$7:$M$78,12,FALSE)","v":0},null,null,null,null,null,null,"レフリー：",{"$f":"VLOOKUP(AM33,【進行】結果入力表!$B$7:$M$78,11,FALSE)","v":0},{"$f":"VLOOKUP(AM33,【進行】結果入力表!$B$7:$M$78,12,FALSE)","v":0},null,null,null,null,null,null,"レフリー：",{"$f":"VLOOKUP(AV33,【進行】結果入力表!$B$7:$M$78,11,FALSE)","v":0},{"$f":"VLOOKUP(AV33,【進行】結果入力表!$B$7:$M$78,12,FALSE)","v":0},null,null,null,null,null,null,"レフリー：",{"$f":"VLOOKUP(BE33,【進行】結果入力表!$B$7:$M$78,11,FALSE)","v":0},{"$f":"VLOOKUP(BE33,【進行】結果入力表!$B$7:$M$78,12,FALSE)","v":0},null,null,null,null,null,null,"レフリー：",{"$f":"VLOOKUP(BN33,【進行】結果入力表!$B$7:$M$78,11,FALSE)","v":0},{"$f":"VLOOKUP(BN33,【進行】結果入力表!$B$7:$M$78,12,FALSE)","v":0}]
[null,{"$f":"【結果】個人成績表!$A$1","v":"第9回　神奈滋対抗戦　　　(奈良；キングスポット)"},null,null,null,null,null,null,null,null,{"$f":"【結果】個人成績表!$A$1","v":"第9回　神奈滋対抗戦　　　(奈良；キングスポット)"},null,null,null,null,null,null,null,null,{"$f":"【結果】個人成績表!$A$1","v":"第9回　神奈滋対抗戦　　　(奈良；キングスポット)"},null,null,null,null,null,null,null,null,{"$f":"【結果】個人成績表!$A$1","v":"第9回　神奈滋対抗戦　　　(奈良；キングスポット)"},null,null,null,null,null,null,null,null,{"$f":"【結果】個人成績表!$A$1","v":"第9回　神奈滋対抗戦　　　(奈良；キングスポット)"},null,null,null,null,null,null,null,null,{"$f":"【結果】個人成績表!$A$1","v":"第9回　神奈滋対抗戦　　　(奈良；キングスポット)"},null,null,null,null,null,null,null,null,{"$f":"【結果】個人成績表!$A$1","v":"第9回　神奈滋対抗戦　　　(奈良；キングスポット)"},null,null,null,null,null,null,null,null,{"$f":"【結果】個人成績表!$A$1","v":"第9回　神奈滋対抗戦　　　(奈良；キングスポット)"},null,null,null,null,null,null," "]
[]
[null,"G-No",{"$f":"【進行】結果入力表!B31","v":25},null,null,"T-No",null,null,null,null,"G-No",{"$f":"【進行】結果入力表!B32","v":26},null,null,"T-No",null,null,null,null,"G-No",{"$f":"【進行】結果入力表!B33","v":27},null,null,"T-No",null,null,null,null,"G-No",{"$f":"【進行】結果入力表!B34","v":28},null,null,"T-No",null,null,null,null,"G-No",{"$f":"【進行】結果入力表!B35","v":29},null,null,"T-No",null,null,null,null,"G-No",{"$f":"【進行】結果入力表!B36","v":30},null,null,"T-No",null,null,null,null,"G-No",{"$f":"【進行】結果入力表!B37","v":31},null,null,"T-No",null,null,null,null,"G-No",{"$f":"【進行】結果入力表!B38","v":32},null,null,"T-No"]
[]
[null,{"$f":"VLOOKUP(C43,【進行】結果入力表!$B$7:$J$78,2,FALSE)","v":"NRC"},null,null,"所属",{"$f":"VLOOKUP(C43,【進行】結果入力表!$B$7:$J$78,9,FALSE)","v":"SBC"},null,null,null,null,{"$f":"VLOOKUP(L43,【進行】結果入力表!$B$7:$J$78,2,FALSE)","v":"NRC"},null,null,"所属",{"$f":"VLOOKUP(L43,【進行】結果入力表!$B$7:$J$78,9,FALSE)","v":"SBC"},null,null,null,null,{"$f":"VLOOKUP(U43,【進行】結果入力表!$B$7:$J$78,2,FALSE)","v":"NRC"},null,null,"所属",{"$f":"VLOOKUP(U43,【進行】結果入力表!$B$7:$J$78,9,FALSE)","v":"SBC"},null,null,null,null,{"$f":"VLOOKUP(AD43,【進行】結果入力表!$B$7:$J$78,2,FALSE)","v":"NRC"},null,null,"所属",{"$f":"VLOOKUP(AD43,【進行】結果入力表!$B$7:$J$78,9,FALSE)","v":"SBC"},null,null,null,null,{"$f":"VLOOKUP(AM43,【進行】結果入力表!$B$7:$J$78,2,FALSE)","v":"NRC"},null,null,"所属",{"$f":"VLOOKUP(AM43,【進行】結果入力表!$B$7:$J$78,9,FALSE)","v":"SBC"},null,null,null,null,{"$f":"VLOOKUP(AV43,【進行】結果入力表!$B$7:$J$78,2,FALSE)","v":"NRC"},null,null,"所属",{"$f":"VLOOKUP(AV43,【進行】結果入力表!$B$7:$J$78,9,FALSE)","v":"SBC"},null,null,null,null,{"$f":"VLOOKUP(BE43,【進行】結果入力表!$B$7:$J$78,2,FALSE)","v":"NRC"},null,null,"所属",{"$f":"VLOOKUP(BE43,【進行】結果入力表!$B$7:$J$78,9,FALSE)","v":"HRC"},null,null,null,null,{"$f":"VLOOKUP(BN43,【進行】結果入力表!$B$7:$J$78,2,FALSE)","v":"NRC"},null,null,"所属",{"$f":"VLOOKUP(BN43,【進行】結果入力表!$B$7:$J$78,9,FALSE)","v":"HRC"}]
[null,{"$f":"VLOOKUP(C43,【進行】結果入力表!$B$7:$J$78,3,FALSE)","v":"岩本　剛"},null,null,"氏名",{"$f":"VLOOKUP(C43,【進行】結果入力表!$B$7:$J$78,8,FALSE)","v":"大橋　正寛"},null,null,null,null,{"$f":"VLOOKUP(L43,【進行】結果入力表!$B$7:$J$78,3,FALSE)","v":"吉向　翔平"},null,null,"氏名",{"$f":"VLOOKUP(L43,【進行】結果入力表!$B$7:$J$78,8,FALSE)","v":"大橋　義治"},null,null,null,null,{"$f":"VLOOKUP(U43,【進行】結果入力表!$B$7:$J$78,3,FALSE)","v":"金澤　茂昌"},null,null,"氏名",{"$f":"VLOOKUP(U43,【進行】結果入力表!$B$7:$J$78,8,FALSE)","v":"山中　康寛"},null,null,null,null,{"$f":"VLOOKUP(AD43,【進行】結果入力表!$B$7:$J$78,3,FALSE)","v":"植田　慎也"},null,null,"氏名",{"$f":"VLOOKUP(AD43,【進行】結果入力表!$B$7:$J$78,8,FALSE)","v":"大橋　洋子"},null,null,null,null,{"$f":"VLOOKUP(AM43,【進行】結果入力表!$B$7:$J$78,3,FALSE)","v":"長谷川　進"},null,null,"氏名",{"$f":"VLOOKUP(AM43,【進行】結果入力表!$B$7:$J$78,8,FALSE)","v":"林　秀忠"},null,null,null,null,{"$f":"VLOOKUP(AV43,【進行】結果入力表!$B$7:$J$78,3,FALSE)","v":"宮野　早織"},null,null,"氏名",{"$f":"VLOOKUP(AV43,【進行】結果入力表!$B$7:$J$78,8,FALSE)","v":"秋田　倫央"},null,null,null,null,{"$f":"VLOOKUP(BE43,【進行】結果入力表!$B$7:$J$78,3,FALSE)","v":"岩本　剛"},null,null,"氏名",{"$f":"VLOOKUP(BE43,【進行】結果入力表!$B$7:$J$78,8,FALSE)","v":"金井　健太郎"},null,null,null,null,{"$f":"VLOOKUP(BN43,【進行】結果入力表!$B$7:$J$78,3,FALSE)","v":"吉向　翔平"},null,null,"氏名",{"$f":"VLOOKUP(BN43,【進行】結果入力表!$B$7:$J$78,8,FALSE)","v":"平井　洸志"}]
[null,null,null,null,"得点",null,null,null,null,null,null,null,null,"得点",null,null,null,null,null,null,null,null,"得点",null,null,null,null,null,null,null,null,"得点",null,null,null,null,null,null,null,null,"得点",null,null,null,null,null,null,null,null,"得点",null,null,null,null,null,null,null,null,"得点",null,null,null,null,null,null,null,null,"得点"]
[null,null,null,null,"HR",null,null,null,null,null,null,null,null,"HR",null,null,null,null,null,null,null,null,"HR",null,null,null,null,null,null,null,null,"HR",null,null,null,null,null,null,null,null,"HR",null,null,null,null,null,null,null,null,"HR",null,null,null,null,null,null,null,null,"HR",null,null,null,null,null,null,null,null,"HR"]
[]
[null,null,null,null,"レフリー：",{"$f":"VLOOKUP(C43,【進行】結果入力表!$B$7:$M$78,11,FALSE)","v":0},{"$f":"VLOOKUP(C43,【進行】結果入力表!$B$7:$M$78,12,FALSE)","v":0},null,null,null,null,null,null,"レフリー：",{"$f":"VLOOKUP(L43,【進行】結果入力表!$B$7:$M$78,11,FALSE)","v":0},{"$f":"VLOOKUP(L43,【進行】結果入力表!$B$7:$M$78,12,FALSE)","v":0},null,null,null,null,null,null,"レフリー：",{"$f":"VLOOKUP(U43,【進行】結果入力表!$B$7:$M$78,11,FALSE)","v":0},{"$f":"VLOOKUP(U43,【進行】結果入力表!$B$7:$M$78,12,FALSE)","v":0},null,null,null,null,null,null,"レフリー：",{"$f":"VLOOKUP(AD43,【進行】結果入力表!$B$7:$M$78,11,FALSE)","v":0},{"$f":"VLOOKUP(AD43,【進行】結果入力表!$B$7:$M$78,12,FALSE)","v":0},null,null,null,null,null,null,"レフリー：",{"$f":"VLOOKUP(AM43,【進行】結果入力表!$B$7:$M$78,11,FALSE)","v":0},{"$f":"VLOOKUP(AM43,【進行】結果入力表!$B$7:$M$78,12,FALSE)","v":0},null,null,null,null,null,null,"レフリー：",{"$f":"VLOOKUP(AV43,【進行】結果入力表!$B$7:$M$78,11,FALSE)","v":0},{"$f":"VLOOKUP(AV43,【進行】結果入力表!$B$7:$M$78,12,FALSE)","v":0},null,null,null,null,null,null,"レフリー：",{"$f":"VLOOKUP(BE43,【進行】結果入力表!$B$7:$M$78,11,FALSE)","v":0},{"$f":"VLOOKUP(BE43,【進行】結果入力表!$B$7:$M$78,12,FALSE)","v":0},null,null,null,null,null,null,"レフリー：",{"$f":"VLOOKUP(BN43,【進行】結果入力表!$B$7:$M$78,11,FALSE)","v":0},{"$f":"VLOOKUP(BN43,【進行】結果入力表!$B$7:$M$78,12,FALSE)","v":0}]
[null,{"$f":"【結果】個人成績表!$A$1","v":"第9回　神奈滋対抗戦　　　(奈良；キングスポット)"},null,null,null,null,null,null,null,null,{"$f":"【結果】個人成績表!$A$1","v":"第9回　神奈滋対抗戦　　　(奈良；キングスポット)"},null,null,null,null,null,null,null,null,{"$f":"【結果】個人成績表!$A$1","v":"第9回　神奈滋対抗戦　　　(奈良；キングスポット)"},null,null,null,null,null,null,null,null,{"$f":"【結果】個人成績表!$A$1","v":"第9回　神奈滋対抗戦　　　(奈良；キングスポット)"},null,null,null,null,null,null,null,null,{"$f":"【結果】個人成績表!$A$1","v":"第9回　神奈滋対抗戦　　　(奈良；キングスポット)"},null,null,null,null,null,null,null,null,{"$f":"【結果】個人成績表!$A$1","v":"第9回　神奈滋対抗戦　　　(奈良；キングスポット)"},null,null,null,null,null,null,null,null,{"$f":"【結果】個人成績表!$A$1","v":"第9回　神奈滋対抗戦　　　(奈良；キングスポット)"},null,null,null,null,null,null,null,null,{"$f":"【結果】個人成績表!$A$1","v":"第9回　神奈滋対抗戦　　　(奈良；キングスポット)"},null,null,null,null,null,null," "]
[]
[null,"G-No",{"$f":"【進行】結果入力表!B39","v":33},null,null,"T-No",null,null,null,null,"G-No",{"$f":"【進行】結果入力表!B40","v":34},null,null,"T-No",null,null,null,null,"G-No",{"$f":"【進行】結果入力表!B41","v":35},null,null,"T-No",null,null,null,null,"G-No",{"$f":"【進行】結果入力表!B42","v":36},null,null,"T-No",null,null,null,null,"G-No",{"$f":"【進行】結果入力表!B43","v":37},null,null,"T-No",null,null,null,null,"G-No",{"$f":"【進行】結果入力表!B44","v":38},null,null,"T-No",null,null,null,null,"G-No",{"$f":"【進行】結果入力表!B45","v":39},null,null,"T-No",null,null,null,null,"G-No",{"$f":"【進行】結果入力表!B46","v":40},null,null,"T-No"]
[]
[null,{"$f":"VLOOKUP(C53,【進行】結果入力表!$B$7:$J$78,2,FALSE)","v":"NRC"},null,null,"所属",{"$f":"VLOOKUP(C53,【進行】結果入力表!$B$7:$J$78,9,FALSE)","v":"HRC"},null,null,null,null,{"$f":"VLOOKUP(L53,【進行】結果入力表!$B$7:$J$78,2,FALSE)","v":"NRC"},null,null,"所属",{"$f":"VLOOKUP(L53,【進行】結果入力表!$B$7:$J$78,9,FALSE)","v":"HRC"},null,null,null,null,{"$f":"VLOOKUP(U53,【進行】結果入力表!$B$7:$J$78,2,FALSE)","v":"NRC"},null,null,"所属",{"$f":"VLOOKUP(U53,【進行】結果入力表!$B$7:$J$78,9,FALSE)","v":"HRC"},null,null,null,null,{"$f":"VLOOKUP(AD53,【進行】結果入力表!$B$7:$J$78,2,FALSE)","v":"NRC"},null,null,"所属",{"$f":"VLOOKUP(AD53,【進行】結果入力表!$B$7:$J$78,9,FALSE)","v":"HRC"},null,null,null,null,{"$f":"VLOOKUP(AM53,【進行】結果入力表!$B$7:$J$78,2,FALSE)","v":"HRC"},null,null,"所属",{"$f":"VLOOKUP(AM53,【進行】結果入力表!$B$7:$J$78,9,FALSE)","v":"SBC"},null,null,null,null,{"$f":"VLOOKUP(AV53,【進行】結果入力表!$B$7:$J$78,2,FALSE)","v":"HRC"},null,null,"所属",{"$f":"VLOOKUP(AV53,【進行】結果入力表!$B$7:$J$78,9,FALSE)","v":"SBC"},null,null,null,null,{"$f":"VLOOKUP(BE53,【進行】結果入力表!$B$7:$J$78,2,FALSE)","v":"HRC"},null,null,"所属",{"$f":"VLOOKUP(BE53,【進行】結果入力表!$B$7:$J$78,9,FALSE)","v":"SBC"},null,null,null,null,{"$f":"VLOOKUP(BN53,【進行】結果入力表!$B$7:$J$78,2,FALSE)","v":"HRC"},null,null,"所属",{"$f":"VLOOKUP(BN53,【進行】結果入力表!$B$7:$J$78,9,FALSE)","v":"SBC"}]
[null,{"$f":"VLOOKUP(C53,【進行】結果入力表!$B$7:$J$78,3,FALSE)","v":"金澤　茂昌"},null,null,"氏名",{"$f":"VLOOKUP(C53,【進行】結果入力表!$B$7:$J$78,8,FALSE)","v":"中尾　亮太"},null,null,null,null,{"$f":"VLOOKUP(L53,【進行】結果入力表!$B$7:$J$78,3,FALSE)","v":"植田　慎也"},null,null,"氏名",{"$f":"VLOOKUP(L53,【進行】結果入力表!$B$7:$J$78,8,FALSE)","v":"宮本　一"},null,null,null,null,{"$f":"VLOOKUP(U53,【進行】結果入力表!$B$7:$J$78,3,FALSE)","v":"長谷川　進"},null,null,"氏名",{"$f":"VLOOKUP(U53,【進行】結果入力表!$B$7:$J$78,8,FALSE)","v":"河地　恵里"},null,null,null,null,{"$f":"VLOOKUP(AD53,【進行】結果入力表!$B$7:$J$78,3,FALSE)","v":"宮野　早織"},null,null,"氏名",{"$f":"VLOOKUP(AD53,【進行】結果入力表!$B$7:$J$78,8,FALSE)","v":"高木　俊行"},null,null,null,null,{"$f":"VLOOKUP(AM53,【進行】結果入力表!$B$7:$J$78,3,FALSE)","v":"平井　洸志"},null,null,"氏名",{"$f":"VLOOKUP(AM53,【進行】結果入力表!$B$7:$J$78,8,FALSE)","v":"山中　康寛"},null,null,null,null,{"$f":"VLOOKUP(AV53,【進行】結果入力表!$B$7:$J$78,3,FALSE)","v":"中尾　亮太"},null,null,"氏名",{"$f":"VLOOKUP(AV53,【進行】結果入力表!$B$7:$J$78,8,FALSE)","v":"大橋　洋子"},null,null,null,null,{"$f":"VLOOKUP(BE53,【進行】結果入力表!$B$7:$J$78,3,FALSE)","v":"宮本　一"},null,null,"氏名",{"$f":"VLOOKUP(BE53,【進行】結果入力表!$B$7:$J$78,8,FALSE)","v":"林　秀忠"},null,null,null,null,{"$f":"VLOOKUP(BN53,【進行】結果入力表!$B$7:$J$78,3,FALSE)","v":"河地　恵里"},null,null,"氏名",{"$f":"VLOOKUP(BN53,【進行】結果入力表!$B$7:$J$78,8,FALSE)","v":"秋田　倫央"}]
[null,null,null,null,"得点",null,null,null,null,null,null,null,null,"得点",null,null,null,null,null,null,null,null,"得点",null,null,null,null,null,null,null,null,"得点",null,null,null,null,null,null,null,null,"得点",null,null,null,null,null,null,null,null,"得点",null,null,null,null,null,null,null,null,"得点",null,null,null,null,null,null,null,null,"得点"]
[null,null,null,null,"HR",null,null,null,null,null,null,null,null,"HR",null,null,null,null,null,null,null,null,"HR",null,null,null,null,null,null,null,null,"HR",null,null,null,null,null,null,null,null,"HR",null,null,null,null,null,null,null,null,"HR",null,null,null,null,null,null,null,null,"HR",null,null,null,null,null,null,null,null,"HR"]
[]
[null,null,null,null,"レフリー：",{"$f":"VLOOKUP(C53,【進行】結果入力表!$B$7:$M$78,11,FALSE)","v":0},{"$f":"VLOOKUP(C53,【進行】結果入力表!$B$7:$M$78,12,FALSE)","v":0},null,null,null,null,null,null,"レフリー：",{"$f":"VLOOKUP(L53,【進行】結果入力表!$B$7:$M$78,11,FALSE)","v":0},{"$f":"VLOOKUP(L53,【進行】結果入力表!$B$7:$M$78,12,FALSE)","v":0},null,null,null,null,null,null,"レフリー：",{"$f":"VLOOKUP(U53,【進行】結果入力表!$B$7:$M$78,11,FALSE)","v":0},{"$f":"VLOOKUP(U53,【進行】結果入力表!$B$7:$M$78,12,FALSE)","v":0},null,null,null,null,null,null,"レフリー：",{"$f":"VLOOKUP(AD53,【進行】結果入力表!$B$7:$M$78,11,FALSE)","v":0},{"$f":"VLOOKUP(AD53,【進行】結果入力表!$B$7:$M$78,12,FALSE)","v":0},null,null,null,null,null,null,"レフリー：",{"$f":"VLOOKUP(AM53,【進行】結果入力表!$B$7:$M$78,11,FALSE)","v":0},{"$f":"VLOOKUP(AM53,【進行】結果入力表!$B$7:$M$78,12,FALSE)","v":0},null,null,null,null,null,null,"レフリー：",{"$f":"VLOOKUP(AV53,【進行】結果入力表!$B$7:$M$78,11,FALSE)","v":0},{"$f":"VLOOKUP(AV53,【進行】結果入力表!$B$7:$M$78,12,FALSE)","v":0},null,null,null,null,null,null,"レフリー：",{"$f":"VLOOKUP(BE53,【進行】結果入力表!$B$7:$M$78,11,FALSE)","v":0},{"$f":"VLOOKUP(BE53,【進行】結果入力表!$B$7:$M$78,12,FALSE)","v":0},null,null,null,null,null,null,"レフリー：",{"$f":"VLOOKUP(BN53,【進行】結果入力表!$B$7:$M$78,11,FALSE)","v":0},{"$f":"VLOOKUP(BN53,【進行】結果入力表!$B$7:$M$78,12,FALSE)","v":0}]
[null,{"$f":"【結果】個人成績表!$A$1","v":"第9回　神奈滋対抗戦　　　(奈良；キングスポット)"},null,null,null,null,null,null,null,null,{"$f":"【結果】個人成績表!$A$1","v":"第9回　神奈滋対抗戦　　　(奈良；キングスポット)"},null,null,null,null,null,null,null,null,{"$f":"【結果】個人成績表!$A$1","v":"第9回　神奈滋対抗戦　　　(奈良；キングスポット)"},null,null,null,null,null,null,null,null,{"$f":"【結果】個人成績表!$A$1","v":"第9回　神奈滋対抗戦　　　(奈良；キングスポット)"},null,null,null,null,null,null,null,null,{"$f":"【結果】個人成績表!$A$1","v":"第9回　神奈滋対抗戦　　　(奈良；キングスポット)"},null,null,null,null,null,null,null,null,{"$f":"【結果】個人成績表!$A$1","v":"第9回　神奈滋対抗戦　　　(奈良；キングスポット)"},null,null,null,null,null,null,null,null,{"$f":"【結果】個人成績表!$A$1","v":"第9回　神奈滋対抗戦　　　(奈良；キングスポット)"},null,null,null,null,null,null,null,null,{"$f":"【結果】個人成績表!$A$1","v":"第9回　神奈滋対抗戦　　　(奈良；キングスポット)"},null,null,null,null,null,null," "]
[]
[null,"G-No",{"$f":"【進行】結果入力表!B47","v":41},null,null,"T-No",null,null,null,null,"G-No",{"$f":"【進行】結果入力表!B48","v":42},null,null,"T-No",null,null,null,null,"G-No",{"$f":"【進行】結果入力表!B49","v":43},null,null,"T-No",null,null,null,null,"G-No",{"$f":"【進行】結果入力表!B50","v":44},null,null,"T-No",null,null,null,null,"G-No",{"$f":"【進行】結果入力表!B51","v":45},null,null,"T-No",null,null,null,null,"G-No",{"$f":"【進行】結果入力表!B52","v":46},null,null,"T-No",null,null,null,null,"G-No",{"$f":"【進行】結果入力表!B53","v":47},null,null,"T-No",null,null,null,null,"G-No",{"$f":"【進行】結果入力表!B54","v":48},null,null,"T-No"]
[]
[null,{"$f":"VLOOKUP(C63,【進行】結果入力表!$B$7:$J$78,2,FALSE)","v":"HRC"},null,null,"所属",{"$f":"VLOOKUP(C63,【進行】結果入力表!$B$7:$J$78,9,FALSE)","v":"SBC"},null,null,null,null,{"$f":"VLOOKUP(L63,【進行】結果入力表!$B$7:$J$78,2,FALSE)","v":"HRC"},null,null,"所属",{"$f":"VLOOKUP(L63,【進行】結果入力表!$B$7:$J$78,9,FALSE)","v":"SBC"},null,null,null,null,{"$f":"VLOOKUP(U63,【進行】結果入力表!$B$7:$J$78,2,FALSE)","v":"NRC"},null,null,"所属",{"$f":"VLOOKUP(U63,【進行】結果入力表!$B$7:$J$78,9,FALSE)","v":"SBC"},null,null,null,null,{"$f":"VLOOKUP(AD63,【進行】結果入力表!$B$7:$J$78,2,FALSE)","v":"NRC"},null,null,"所属",{"$f":"VLOOKUP(AD63,【進行】結果入力表!$B$7:$J$78,9,FALSE)","v":"SBC"},null,null,null,null,{"$f":"VLOOKUP(AM63,【進行】結果入力表!$B$7:$J$78,2,FALSE)","v":"NRC"},null,null,"所属",{"$f":"VLOOKUP(AM63,【進行】結果入力表!$B$7:$J$78,9,FALSE)","v":"SBC"},null,null,null,null,{"$f":"VLOOKUP(AV63,【進行】結果入力表!$B$7:$J$78,2,FALSE)","v":"NRC"},null,null,"所属",{"$f":"VLOOKUP(AV63,【進行】結果入力表!$B$7:$J$78,9,FALSE)","v":"SBC"},null,null,null,null,{"$f":"VLOOKUP(BE63,【進行】結果入力表!$B$7:$J$78,2,FALSE)","v":"NRC"},null,null,"所属",{"$f":"VLOOKUP(BE63,【進行】結果入力表!$B$7:$J$78,9,FALSE)","v":"SBC"},null,null,null,null,{"$f":"VLOOKUP(BN63,【進行】結果入力表!$B$7:$J$78,2,FALSE)","v":"NRC"},null,null,"所属",{"$f":"VLOOKUP(BN63,【進行】結果入力表!$B$7:$J$78,9,FALSE)","v":"SBC"}]
[null,{"$f":"VLOOKUP(C63,【進行】結果入力表!$B$7:$J$78,3,FALSE)","v":"高木　俊行"},null,null,"氏名",{"$f":"VLOOKUP(C63,【進行】結果入力表!$B$7:$J$78,8,FALSE)","v":"大橋　正寛"},null,null,null,null,{"$f":"VLOOKUP(L63,【進行】結果入力表!$B$7:$J$78,3,FALSE)","v":"金井　健太郎"},null,null,"氏名",{"$f":"VLOOKUP(L63,【進行】結果入力表!$B$7:$J$78,8,FALSE)","v":"大橋　義治"},null,null,null,null,{"$f":"VLOOKUP(U63,【進行】結果入力表!$B$7:$J$78,3,FALSE)","v":"岩本　剛"},null,null,"氏名",{"$f":"VLOOKUP(U63,【進行】結果入力表!$B$7:$J$78,8,FALSE)","v":"山中　康寛"},null,null,null,null,{"$f":"VLOOKUP(AD63,【進行】結果入力表!$B$7:$J$78,3,FALSE)","v":"吉向　翔平"},null,null,"氏名",{"$f":"VLOOKUP(AD63,【進行】結果入力表!$B$7:$J$78,8,FALSE)","v":"大橋　洋子"},null,null,null,null,{"$f":"VLOOKUP(AM63,【進行】結果入力表!$B$7:$J$78,3,FALSE)","v":"金澤　茂昌"},null,null,"氏名",{"$f":"VLOOKUP(AM63,【進行】結果入力表!$B$7:$J$78,8,FALSE)","v":"林　秀忠"},null,null,null,null,{"$f":"VLOOKUP(AV63,【進行】結果入力表!$B$7:$J$78,3,FALSE)","v":"植田　慎也"},null,null,"氏名",{"$f":"VLOOKUP(AV63,【進行】結果入力表!$B$7:$J$78,8,FALSE)","v":"秋田　倫央"},null,null,null,null,{"$f":"VLOOKUP(BE63,【進行】結果入力表!$B$7:$J$78,3,FALSE)","v":"長谷川　進"},null,null,"氏名",{"$f":"VLOOKUP(BE63,【進行】結果入力表!$B$7:$J$78,8,FALSE)","v":"大橋　正寛"},null,null,null,null,{"$f":"VLOOKUP(BN63,【進行】結果入力表!$B$7:$J$78,3,FALSE)","v":"宮野　早織"},null,null,"氏名",{"$f":"VLOOKUP(BN63,【進行】結果入力表!$B$7:$J$78,8,FALSE)","v":"大橋　義治"}]
[null,null,null,null,"得点",null,null,null,null,null,null,null,null,"得点",null,null,null,null,null,null,null,null,"得点",null,null,null,null,null,null,null,null,"得点",null,null,null,null,null,null,null,null,"得点",null,null,null,null,null,null,null,null,"得点",null,null,null,null,null,null,null,null,"得点",null,null,null,null,null,null,null,null,"得点"]
[null,null,null,null,"HR",null,null,null,null,null,null,null,null,"HR",null,null,null,null,null,null,null,null,"HR",null,null,null,null,null,null,null,null,"HR",null,null,null,null,null,null,null,null,"HR",null,null,null,null,null,null,null,null,"HR",null,null,null,null,null,null,null,null,"HR",null,null,null,null,null,null,null,null,"HR"]
[]
[null,null,null,null,"レフリー：",{"$f":"VLOOKUP(C63,【進行】結果入力表!$B$7:$M$78,11,FALSE)","v":0},{"$f":"VLOOKUP(C63,【進行】結果入力表!$B$7:$M$78,12,FALSE)","v":0},null,null,null,null,null,null,"レフリー：",{"$f":"VLOOKUP(L63,【進行】結果入力表!$B$7:$M$78,11,FALSE)","v":0},{"$f":"VLOOKUP(L63,【進行】結果入力表!$B$7:$M$78,12,FALSE)","v":0},null,null,null,null,null,null,"レフリー：",{"$f":"VLOOKUP(U63,【進行】結果入力表!$B$7:$M$78,11,FALSE)","v":0},{"$f":"VLOOKUP(U63,【進行】結果入力表!$B$7:$M$78,12,FALSE)","v":0},null,null,null,null,null,null,"レフリー：",{"$f":"VLOOKUP(AD63,【進行】結果入力表!$B$7:$M$78,11,FALSE)","v":0},{"$f":"VLOOKUP(AD63,【進行】結果入力表!$B$7:$M$78,12,FALSE)","v":0},null,null,null,null,null,null,"レフリー：",{"$f":"VLOOKUP(AM63,【進行】結果入力表!$B$7:$M$78,11,FALSE)","v":0},{"$f":"VLOOKUP(AM63,【進行】結果入力表!$B$7:$M$78,12,FALSE)","v":0},null,null,null,null,null,null,"レフリー：",{"$f":"VLOOKUP(AV63,【進行】結果入力表!$B$7:$M$78,11,FALSE)","v":0},{"$f":"VLOOKUP(AV63,【進行】結果入力表!$B$7:$M$78,12,FALSE)","v":0},null,null,null,null,null,null,"レフリー：",{"$f":"VLOOKUP(BE63,【進行】結果入力表!$B$7:$M$78,11,FALSE)","v":0},{"$f":"VLOOKUP(BE63,【進行】結果入力表!$B$7:$M$78,12,FALSE)","v":0},null,null,null,null,null,null,"レフリー：",{"$f":"VLOOKUP(BN63,【進行】結果入力表!$B$7:$M$78,11,FALSE)","v":0},{"$f":"VLOOKUP(BN63,【進行】結果入力表!$B$7:$M$78,12,FALSE)","v":0}]
[null,{"$f":"【結果】個人成績表!$A$1","v":"第9回　神奈滋対抗戦　　　(奈良；キングスポット)"},null,null,null,null,null,null,null,null,{"$f":"【結果】個人成績表!$A$1","v":"第9回　神奈滋対抗戦　　　(奈良；キングスポット)"},null,null,null,null,null,null,null,null,{"$f":"【結果】個人成績表!$A$1","v":"第9回　神奈滋対抗戦　　　(奈良；キングスポット)"},null,null,null,null,null,null,null,null,{"$f":"【結果】個人成績表!$A$1","v":"第9回　神奈滋対抗戦　　　(奈良；キングスポット)"},null,null,null,null,null,null,null,null,{"$f":"【結果】個人成績表!$A$1","v":"第9回　神奈滋対抗戦　　　(奈良；キングスポット)"},null,null,null,null,null,null,null,null,{"$f":"【結果】個人成績表!$A$1","v":"第9回　神奈滋対抗戦　　　(奈良；キングスポット)"},null,null,null,null,null,null,null,null,{"$f":"【結果】個人成績表!$A$1","v":"第9回　神奈滋対抗戦　　　(奈良；キングスポット)"},null,null,null,null,null,null,null,null,{"$f":"【結果】個人成績表!$A$1","v":"第9回　神奈滋対抗戦　　　(奈良；キングスポット)"},null,null,null,null,null,null," "]
[]
[null,"G-No",{"$f":"【進行】結果入力表!B55","v":49},null,null,"T-No",null,null,null,null,"G-No",{"$f":"【進行】結果入力表!B56","v":50},null,null,"T-No",null,null,null,null,"G-No",{"$f":"【進行】結果入力表!B57","v":51},null,null,"T-No",null,null,null,null,"G-No",{"$f":"【進行】結果入力表!B58","v":52},null,null,"T-No",null,null,null,null,"G-No",{"$f":"【進行】結果入力表!B59","v":53},null,null,"T-No",null,null,null,null,"G-No",{"$f":"【進行】結果入力表!B60","v":54},null,null,"T-No",null,null,null,null,"G-No",{"$f":"【進行】結果入力表!B61","v":55},null,null,"T-No",null,null,null,null,"G-No",{"$f":"【進行】結果入力表!B62","v":56},null,null,"T-No"]
[]
[null,{"$f":"VLOOKUP(C73,【進行】結果入力表!$B$7:$J$78,2,FALSE)","v":"NRC"},null,null,"所属",{"$f":"VLOOKUP(C73,【進行】結果入力表!$B$7:$J$78,9,FALSE)","v":"HRC"},null,null,null,null,{"$f":"VLOOKUP(L73,【進行】結果入力表!$B$7:$J$78,2,FALSE)","v":"NRC"},null,null,"所属",{"$f":"VLOOKUP(L73,【進行】結果入力表!$B$7:$J$78,9,FALSE)","v":"HRC"},null,null,null,null,{"$f":"VLOOKUP(U73,【進行】結果入力表!$B$7:$J$78,2,FALSE)","v":"NRC"},null,null,"所属",{"$f":"VLOOKUP(U73,【進行】結果入力表!$B$7:$J$78,9,FALSE)","v":"HRC"},null,null,null,null,{"$f":"VLOOKUP(AD73,【進行】結果入力表!$B$7:$J$78,2,FALSE)","v":"NRC"},null,null,"所属",{"$f":"VLOOKUP(AD73,【進行】結果入力表!$B$7:$J$78,9,FALSE)","v":"HRC"},null,null,null,null,{"$f":"VLOOKUP(AM73,【進行】結果入力表!$B$7:$J$78,2,FALSE)","v":"NRC"},null,null,"所属",{"$f":"VLOOKUP(AM73,【進行】結果入力表!$B$7:$J$78,9,FALSE)","v":"HRC"},null,null,null,null,{"$f":"VLOOKUP(AV73,【進行】結果入力表!$B$7:$J$78,2,FALSE)","v":"NRC"},null,null,"所属",{"$f":"VLOOKUP(AV73,【進行】結果入力表!$B$7:$J$78,9,FALSE)","v":"HRC"},null,null,null,null,{"$f":"VLOOKUP(BE73,【進行】結果入力表!$B$7:$J$78,2,FALSE)","v":{"$error":"#N/A"}},null,null,"所属",{"$f":"VLOOKUP(BE73,【進行】結果入力表!$B$7:$J$78,9,FALSE)","v":{"$error":"#N/A"}},null,null,null,null,{"$f":"VLOOKUP(BN73,【進行】結果入力表!$B$7:$J$78,2,FALSE)","v":{"$error":"#N/A"}},null,null,"所属",{"$f":"VLOOKUP(BN73,【進行】結果入力表!$B$7:$J$78,9,FALSE)","v":{"$error":"#N/A"}}]
[null,{"$f":"VLOOKUP(C73,【進行】結果入力表!$B$7:$J$78,3,FALSE)","v":"岩本　剛"},null,null,"氏名",{"$f":"VLOOKUP(C73,【進行】結果入力表!$B$7:$J$78,8,FALSE)","v":"平井　洸志"},null,null,null,null,{"$f":"VLOOKUP(L73,【進行】結果入力表!$B$7:$J$78,3,FALSE)","v":"吉向　翔平"},null,null,"氏名",{"$f":"VLOOKUP(L73,【進行】結果入力表!$B$7:$J$78,8,FALSE)","v":"中尾　亮太"},null,null,null,null,{"$f":"VLOOKUP(U73,【進行】結果入力表!$B$7:$J$78,3,FALSE)","v":"金澤　茂昌"},null,null,"氏名",{"$f":"VLOOKUP(U73,【進行】結果入力表!$B$7:$J$78,8,FALSE)","v":"宮本　一"},null,null,null,null,{"$f":"VLOOKUP(AD73,【進行】結果入力表!$B$7:$J$78,3,FALSE)","v":"植田　慎也"},null,null,"氏名",{"$f":"VLOOKUP(AD73,【進行】結果入力表!$B$7:$J$78,8,FALSE)","v":"河地　恵里"},null,null,null,null,{"$f":"VLOOKUP(AM73,【進行】結果入力表!$B$7:$J$78,3,FALSE)","v":"長谷川　進"},null,null,"氏名",{"$f":"VLOOKUP(AM73,【進行】結果入力表!$B$7:$J$78,8,FALSE)","v":"高木　俊行"},null,null,null,null,{"$f":"VLOOKUP(AV73,【進行】結果入力表!$B$7:$J$78,3,FALSE)","v":"宮野　早織"},null,null,"氏名",{"$f":"VLOOKUP(AV73,【進行】結果入力表!$B$7:$J$78,8,FALSE)","v":"金井　健太郎"},null,null,null,null,{"$f":"VLOOKUP(BE73,【進行】結果入力表!$B$7:$J$78,3,FALSE)","v":{"$error":"#N/A"}},null,null,"氏名",{"$f":"VLOOKUP(BE73,【進行】結果入力表!$B$7:$J$78,8,FALSE)","v":{"$error":"#N/A"}},null,null,null,null,{"$f":"VLOOKUP(BN73,【進行】結果入力表!$B$7:$J$78,3,FALSE)","v":{"$error":"#N/A"}},null,null,"氏名",{"$f":"VLOOKUP(BN73,【進行】結果入力表!$B$7:$J$78,8,FALSE)","v":{"$error":"#N/A"}}]
[null,null,null,null,"得点",null,null,null,null,null,null,null,null,"得点",null,null,null,null,null,null,null,null,"得点",null,null,null,null,null,null,null,null,"得点",null,null,null,null,null,null,null,null,"得点",null,null,null,null,null,null,null,null,"得点",null,null,null,null,null,null,null,null,"得点",null,null,null,null,null,null,null,null,"得点"]
[null,null,null,null,"HR",null,null,null,null,null,null,null,null,"HR",null,null,null,null,null,null,null,null,"HR",null,null,null,null,null,null,null,null,"HR",null,null,null,null,null,null,null,null,"HR",null,null,null,null,null,null,null,null,"HR",null,null,null,null,null,null,null,null,"HR",null,null,null,null,null,null,null,null,"HR"]
[]
[null,null,null,null,"レフリー：",{"$f":"VLOOKUP(C73,【進行】結果入力表!$B$7:$M$78,11,FALSE)","v":0},{"$f":"VLOOKUP(C73,【進行】結果入力表!$B$7:$M$78,12,FALSE)","v":0},null,null,null,null,null,null,"レフリー：",{"$f":"VLOOKUP(L73,【進行】結果入力表!$B$7:$M$78,11,FALSE)","v":0},{"$f":"VLOOKUP(L73,【進行】結果入力表!$B$7:$M$78,12,FALSE)","v":0},null,null,null,null,null,null,"レフリー：",{"$f":"VLOOKUP(U73,【進行】結果入力表!$B$7:$M$78,11,FALSE)","v":0},{"$f":"VLOOKUP(U73,【進行】結果入力表!$B$7:$M$78,12,FALSE)","v":0},null,null,null,null,null,null,"レフリー：",{"$f":"VLOOKUP(AD73,【進行】結果入力表!$B$7:$M$78,11,FALSE)","v":0},{"$f":"VLOOKUP(AD73,【進行】結果入力表!$B$7:$M$78,12,FALSE)","v":0},null,null,null,null,null,null,"レフリー：",{"$f":"VLOOKUP(AM73,【進行】結果入力表!$B$7:$M$78,11,FALSE)","v":0},{"$f":"VLOOKUP(AM73,【進行】結果入力表!$B$7:$M$78,12,FALSE)","v":0},null,null,null,null,null,null,"レフリー：",{"$f":"VLOOKUP(AV73,【進行】結果入力表!$B$7:$M$78,11,FALSE)","v":0},{"$f":"VLOOKUP(AV73,【進行】結果入力表!$B$7:$M$78,12,FALSE)","v":0},null,null,null,null,null,null,"レフリー：",{"$f":"VLOOKUP(BE73,【進行】結果入力表!$B$7:$M$78,11,FALSE)","v":0},{"$f":"VLOOKUP(BE73,【進行】結果入力表!$B$7:$M$78,12,FALSE)","v":0},null,null,null,null,null,null,"レフリー：",{"$f":"VLOOKUP(BN73,【進行】結果入力表!$B$7:$M$78,11,FALSE)","v":0},{"$f":"VLOOKUP(BN73,【進行】結果入力表!$B$7:$M$78,12,FALSE)","v":0}]
[null,{"$f":"【結果】個人成績表!$A$1","v":"第9回　神奈滋対抗戦　　　(奈良；キングスポット)"},null,null,null,null,null,null,null,null,{"$f":"【結果】個人成績表!$A$1","v":"第9回　神奈滋対抗戦　　　(奈良；キングスポット)"},null,null,null,null,null,null,null,null,{"$f":"【結果】個人成績表!$A$1","v":"第9回　神奈滋対抗戦　　　(奈良；キングスポット)"},null,null,null,null,null,null,null,null,{"$f":"【結果】個人成績表!$A$1","v":"第9回　神奈滋対抗戦　　　(奈良；キングスポット)"},null,null,null,null,null,null,null,null,{"$f":"【結果】個人成績表!$A$1","v":"第9回　神奈滋対抗戦　　　(奈良；キングスポット)"},null,null,null,null,null,null,null,null,{"$f":"【結果】個人成績表!$A$1","v":"第9回　神奈滋対抗戦　　　(奈良；キングスポット)"},null,null,null,null,null,null,null,null,{"$f":"【結果】個人成績表!$A$1","v":"第9回　神奈滋対抗戦　　　(奈良；キングスポット)"},null,null,null,null,null,null,null,null,{"$f":"【結果】個人成績表!$A$1","v":"第9回　神奈滋対抗戦　　　(奈良；キングスポット)"},null,null,null,null,null,null," "]
[]
[null,"G-No",{"$f":"【進行】結果入力表!B63","v":57},null,null,"T-No",null,null,null,null,"G-No",{"$f":"【進行】結果入力表!B64","v":58},null,null,"T-No",null,null,null,null,"G-No",{"$f":"【進行】結果入力表!B65","v":59},null,null,"T-No",null,null,null,null,"G-No",{"$f":"【進行】結果入力表!B66","v":60},null,null,"T-No",null,null,null,null,"G-No",{"$f":"【進行】結果入力表!B67","v":61},null,null,"T-No",null,null,null,null,"G-No",{"$f":"【進行】結果入力表!B68","v":62},null,null,"T-No",null,null,null,null,"G-No",{"$f":"【進行】結果入力表!B69","v":63},null,null,"T-No",null,null,null,null,"G-No",{"$f":"【進行】結果入力表!B70","v":64},null,null,"T-No"]
[]
[null,{"$f":"VLOOKUP(C83,【進行】結果入力表!$B$7:$J$78,2,FALSE)","v":{"$error":"#N/A"}},null,null,"所属",{"$f":"VLOOKUP(C83,【進行】結果入力表!$B$7:$J$78,9,FALSE)","v":{"$error":"#N/A"}},null,null,null,null,{"$f":"VLOOKUP(L83,【進行】結果入力表!$B$7:$J$78,2,FALSE)","v":{"$error":"#N/A"}},null,null,"所属",{"$f":"VLOOKUP(L83,【進行】結果入力表!$B$7:$J$78,9,FALSE)","v":{"$error":"#N/A"}},null,null,null,null,{"$f":"VLOOKUP(U83,【進行】結果入力表!$B$7:$J$78,2,FALSE)","v":{"$error":"#N/A"}},null,null,"所属",{"$f":"VLOOKUP(U83,【進行】結果入力表!$B$7:$J$78,9,FALSE)","v":{"$error":"#N/A"}},null,null,null,null,{"$f":"VLOOKUP(AD83,【進行】結果入力表!$B$7:$J$78,2,FALSE)","v":{"$error":"#N/A"}},null,null,"所属",{"$f":"VLOOKUP(AD83,【進行】結果入力表!$B$7:$J$78,9,FALSE)","v":{"$error":"#N/A"}},null,null,null,null,{"$f":"VLOOKUP(AM83,【進行】結果入力表!$B$7:$J$78,2,FALSE)","v":{"$error":"#N/A"}},null,null,"所属",{"$f":"VLOOKUP(AM83,【進行】結果入力表!$B$7:$J$78,9,FALSE)","v":{"$error":"#N/A"}},null,null,null,null,{"$f":"VLOOKUP(AV83,【進行】結果入力表!$B$7:$J$78,2,FALSE)","v":{"$error":"#N/A"}},null,null,"所属",{"$f":"VLOOKUP(AV83,【進行】結果入力表!$B$7:$J$78,9,FALSE)","v":{"$error":"#N/A"}},null,null,null,null,{"$f":"VLOOKUP(BE83,【進行】結果入力表!$B$7:$J$78,2,FALSE)","v":{"$error":"#N/A"}},null,null,"所属",{"$f":"VLOOKUP(BE83,【進行】結果入力表!$B$7:$J$78,9,FALSE)","v":{"$error":"#N/A"}},null,null,null,null,{"$f":"VLOOKUP(BN83,【進行】結果入力表!$B$7:$J$78,2,FALSE)","v":{"$error":"#N/A"}},null,null,"所属",{"$f":"VLOOKUP(BN83,【進行】結果入力表!$B$7:$J$78,9,FALSE)","v":{"$error":"#N/A"}}]
[null,{"$f":"VLOOKUP(C83,【進行】結果入力表!$B$7:$J$78,3,FALSE)","v":{"$error":"#N/A"}},null,null,"氏名",{"$f":"VLOOKUP(C83,【進行】結果入力表!$B$7:$J$78,8,FALSE)","v":{"$error":"#N/A"}},null,null,null,null,{"$f":"VLOOKUP(L83,【進行】結果入力表!$B$7:$J$78,3,FALSE)","v":{"$error":"#N/A"}},null,null,"氏名",{"$f":"VLOOKUP(L83,【進行】結果入力表!$B$7:$J$78,8,FALSE)","v":{"$error":"#N/A"}},null,null,null,null,{"$f":"VLOOKUP(U83,【進行】結果入力表!$B$7:$J$78,3,FALSE)","v":{"$error":"#N/A"}},null,null,"氏名",{"$f":"VLOOKUP(U83,【進行】結果入力表!$B$7:$J$78,8,FALSE)","v":{"$error":"#N/A"}},null,null,null,null,{"$f":"VLOOKUP(AD83,【進行】結果入力表!$B$7:$J$78,3,FALSE)","v":{"$error":"#N/A"}},null,null,"氏名",{"$f":"VLOOKUP(AD83,【進行】結果入力表!$B$7:$J$78,8,FALSE)","v":{"$error":"#N/A"}},null,null,null,null,{"$f":"VLOOKUP(AM83,【進行】結果入力表!$B$7:$J$78,3,FALSE)","v":{"$error":"#N/A"}},null,null,"氏名",{"$f":"VLOOKUP(AM83,【進行】結果入力表!$B$7:$J$78,8,FALSE)","v":{"$error":"#N/A"}},null,null,null,null,{"$f":"VLOOKUP(AV83,【進行】結果入力表!$B$7:$J$78,3,FALSE)","v":{"$error":"#N/A"}},null,null,"氏名",{"$f":"VLOOKUP(AV83,【進行】結果入力表!$B$7:$J$78,8,FALSE)","v":{"$error":"#N/A"}},null,null,null,null,{"$f":"VLOOKUP(BE83,【進行】結果入力表!$B$7:$J$78,3,FALSE)","v":{"$error":"#N/A"}},null,null,"氏名",{"$f":"VLOOKUP(BE83,【進行】結果入力表!$B$7:$J$78,8,FALSE)","v":{"$error":"#N/A"}},null,null,null,null,{"$f":"VLOOKUP(BN83,【進行】結果入力表!$B$7:$J$78,3,FALSE)","v":{"$error":"#N/A"}},null,null,"氏名",{"$f":"VLOOKUP(BN83,【進行】結果入力表!$B$7:$J$78,8,FALSE)","v":{"$error":"#N/A"}}]
[null,null,null,null,"得点",null,null,null,null,null,null,null,null,"得点",null,null,null,null,null,null,null,null,"得点",null,null,null,null,null,null,null,null,"得点",null,null,null,null,null,null,null,null,"得点",null,null,null,null,null,null,null,null,"得点",null,null,null,null,null,null,null,null,"得点",null,null,null,null,null,null,null,null,"得点"]
[null,null,null,null,"HR",null,null,null,null,null,null,null,null,"HR",null,null,null,null,null,null,null,null,"HR",null,null,null,null,null,null,null,null,"HR",null,null,null,null,null,null,null,null,"HR",null,null,null,null,null,null,null,null,"HR",null,null,null,null,null,null,null,null,"HR",null,null,null,null,null,null,null,null,"HR"]
[]
[null,null,null,null,"レフリー：",{"$f":"VLOOKUP(C83,【進行】結果入力表!$B$7:$M$78,11,FALSE)","v":0},{"$f":"VLOOKUP(C83,【進行】結果入力表!$B$7:$M$78,12,FALSE)","v":0},null,null,null,null,null,null,"レフリー：",{"$f":"VLOOKUP(L83,【進行】結果入力表!$B$7:$M$78,11,FALSE)","v":0},{"$f":"VLOOKUP(L83,【進行】結果入力表!$B$7:$M$78,12,FALSE)","v":0},null,null,null,null,null,null,"レフリー：",{"$f":"VLOOKUP(U83,【進行】結果入力表!$B$7:$M$78,11,FALSE)","v":0},{"$f":"VLOOKUP(U83,【進行】結果入力表!$B$7:$M$78,12,FALSE)","v":0},null,null,null,null,null,null,"レフリー：",{"$f":"VLOOKUP(AD83,【進行】結果入力表!$B$7:$M$78,11,FALSE)","v":0},{"$f":"VLOOKUP(AD83,【進行】結果入力表!$B$7:$M$78,12,FALSE)","v":0},null,null,null,null,null,null,"レフリー：",{"$f":"VLOOKUP(AM83,【進行】結果入力表!$B$7:$M$78,11,FALSE)","v":0},{"$f":"VLOOKUP(AM83,【進行】結果入力表!$B$7:$M$78,12,FALSE)","v":0},null,null,null,null,null,null,"レフリー：",{"$f":"VLOOKUP(AV83,【進行】結果入力表!$B$7:$M$78,11,FALSE)","v":0},{"$f":"VLOOKUP(AV83,【進行】結果入力表!$B$7:$M$78,12,FALSE)","v":0},null,null,null,null,null,null,"レフリー：",{"$f":"VLOOKUP(BE83,【進行】結果入力表!$B$7:$M$78,11,FALSE)","v":{"$error":"#N/A"}},{"$f":"VLOOKUP(BE83,【進行】結果入力表!$B$7:$M$78,12,FALSE)","v":{"$error":"#N/A"}},null,null,null,null,null,null,"レフリー：",{"$f":"VLOOKUP(BN83,【進行】結果入力表!$B$7:$M$78,11,FALSE)","v":{"$error":"#N/A"}},{"$f":"VLOOKUP(BN83,【進行】結果入力表!$B$7:$M$78,12,FALSE)","v":{"$error":"#N/A"}}]
[null,{"$f":"【結果】個人成績表!$A$1","v":"第9回　神奈滋対抗戦　　　(奈良；キングスポット)"},null,null,null,null,null,null,null,null,{"$f":"【結果】個人成績表!$A$1","v":"第9回　神奈滋対抗戦　　　(奈良；キングスポット)"},null,null,null,null,null,null,null,null,{"$f":"【結果】個人成績表!$A$1","v":"第9回　神奈滋対抗戦　　　(奈良；キングスポット)"},null,null,null,null,null,null,null,null,{"$f":"【結果】個人成績表!$A$1","v":"第9回　神奈滋対抗戦　　　(奈良；キングスポット)"},null,null,null,null,null,null,null,null,{"$f":"【結果】個人成績表!$A$1","v":"第9回　神奈滋対抗戦　　　(奈良；キングスポット)"},null,null,null,null,null,null,null,null,{"$f":"【結果】個人成績表!$A$1","v":"第9回　神奈滋対抗戦　　　(奈良；キングスポット)"},null,null,null,null,null,null,null,null,{"$f":"【結果】個人成績表!$A$1","v":"第9回　神奈滋対抗戦　　　(奈良；キングスポット)"},null,null,null,null,null,null,null,null,{"$f":"【結果】個人成績表!$A$1","v":"第9回　神奈滋対抗戦　　　(奈良；キングスポット)"},null,null,null,null,null,null," "]
[]
[null,"G-No",{"$f":"【進行】結果入力表!B71","v":65},null,null,"T-No",null,null,null,null,"G-No",{"$f":"【進行】結果入力表!B72","v":66},null,null,"T-No",null,null,null,null,"G-No",{"$f":"【進行】結果入力表!B73","v":67},null,null,"T-No",null,null,null,null,"G-No",{"$f":"【進行】結果入力表!B74","v":68},null,null,"T-No",null,null,null,null,"G-No",{"$f":"【進行】結果入力表!B75","v":69},null,null,"T-No",null,null,null,null,"G-No",{"$f":"【進行】結果入力表!B76","v":70},null,null,"T-No",null,null,null,null,"G-No",{"$f":"【進行】結果入力表!B77","v":71},null,null,"T-No",null,null,null,null,"G-No",{"$f":"【進行】結果入力表!B78","v":72},null,null,"T-No"]
[]
[null,{"$f":"VLOOKUP(C93,【進行】結果入力表!$B$7:$J$78,2,FALSE)","v":{"$error":"#N/A"}},null,null,"所属",{"$f":"VLOOKUP(C93,【進行】結果入力表!$B$7:$J$78,9,FALSE)","v":{"$error":"#N/A"}},null,null,null,null,{"$f":"VLOOKUP(L93,【進行】結果入力表!$B$7:$J$78,2,FALSE)","v":{"$error":"#N/A"}},null,null,"所属",{"$f":"VLOOKUP(L93,【進行】結果入力表!$B$7:$J$78,9,FALSE)","v":{"$error":"#N/A"}},null,null,null,null,{"$f":"VLOOKUP(U93,【進行】結果入力表!$B$7:$J$78,2,FALSE)","v":{"$error":"#N/A"}},null,null,"所属",{"$f":"VLOOKUP(U93,【進行】結果入力表!$B$7:$J$78,9,FALSE)","v":{"$error":"#N/A"}},null,null,null,null,{"$f":"VLOOKUP(AD93,【進行】結果入力表!$B$7:$J$78,2,FALSE)","v":{"$error":"#N/A"}},null,null,"所属",{"$f":"VLOOKUP(AD93,【進行】結果入力表!$B$7:$J$78,9,FALSE)","v":{"$error":"#N/A"}},null,null,null,null,{"$f":"VLOOKUP(AM93,【進行】結果入力表!$B$7:$J$78,2,FALSE)","v":{"$error":"#N/A"}},null,null,"所属",{"$f":"VLOOKUP(AM93,【進行】結果入力表!$B$7:$J$78,9,FALSE)","v":{"$error":"#N/A"}},null,null,null,null,{"$f":"VLOOKUP(AV93,【進行】結果入力表!$B$7:$J$78,2,FALSE)","v":{"$error":"#N/A"}},null,null,"所属",{"$f":"VLOOKUP(AV93,【進行】結果入力表!$B$7:$J$78,9,FALSE)","v":{"$error":"#N/A"}},null,null,null,null,{"$f":"VLOOKUP(BE93,【進行】結果入力表!$B$7:$J$78,2,FALSE)","v":{"$error":"#N/A"}},null,null,"所属",{"$f":"VLOOKUP(BE93,【進行】結果入力表!$B$7:$J$78,9,FALSE)","v":{"$error":"#N/A"}},null,null,null,null,{"$f":"VLOOKUP(BN93,【進行】結果入力表!$B$7:$J$78,2,FALSE)","v":{"$error":"#N/A"}},null,null,"所属",{"$f":"VLOOKUP(BN93,【進行】結果入力表!$B$7:$J$78,9,FALSE)","v":{"$error":"#N/A"}}]
[null,{"$f":"VLOOKUP(C93,【進行】結果入力表!$B$7:$J$78,3,FALSE)","v":{"$error":"#N/A"}},null,null,"氏名",{"$f":"VLOOKUP(C93,【進行】結果入力表!$B$7:$J$78,8,FALSE)","v":{"$error":"#N/A"}},null,null,null,null,{"$f":"VLOOKUP(L93,【進行】結果入力表!$B$7:$J$78,3,FALSE)","v":{"$error":"#N/A"}},null,null,"氏名",{"$f":"VLOOKUP(L93,【進行】結果入力表!$B$7:$J$78,8,FALSE)","v":{"$error":"#N/A"}},null,null,null,null,{"$f":"VLOOKUP(U93,【進行】結果入力表!$B$7:$J$78,3,FALSE)","v":{"$error":"#N/A"}},null,null,"氏名",{"$f":"VLOOKUP(U93,【進行】結果入力表!$B$7:$J$78,8,FALSE)","v":{"$error":"#N/A"}},null,null,null,null,{"$f":"VLOOKUP(AD93,【進行】結果入力表!$B$7:$J$78,3,FALSE)","v":{"$error":"#N/A"}},null,null,"氏名",{"$f":"VLOOKUP(AD93,【進行】結果入力表!$B$7:$J$78,8,FALSE)","v":{"$error":"#N/A"}},null,null,null,null,{"$f":"VLOOKUP(AM93,【進行】結果入力表!$B$7:$J$78,3,FALSE)","v":{"$error":"#N/A"}},null,null,"氏名",{"$f":"VLOOKUP(AM93,【進行】結果入力表!$B$7:$J$78,8,FALSE)","v":{"$error":"#N/A"}},null,null,null,null,{"$f":"VLOOKUP(AV93,【進行】結果入力表!$B$7:$J$78,3,FALSE)","v":{"$error":"#N/A"}},null,null,"氏名",{"$f":"VLOOKUP(AV93,【進行】結果入力表!$B$7:$J$78,8,FALSE)","v":{"$error":"#N/A"}},null,null,null,null,{"$f":"VLOOKUP(BE93,【進行】結果入力表!$B$7:$J$78,3,FALSE)","v":{"$error":"#N/A"}},null,null,"氏名",{"$f":"VLOOKUP(BE93,【進行】結果入力表!$B$7:$J$78,8,FALSE)","v":{"$error":"#N/A"}},null,null,null,null,{"$f":"VLOOKUP(BN93,【進行】結果入力表!$B$7:$J$78,3,FALSE)","v":{"$error":"#N/A"}},null,null,"氏名",{"$f":"VLOOKUP(BN93,【進行】結果入力表!$B$7:$J$78,8,FALSE)","v":{"$error":"#N/A"}}]
[null,null,null,null,"得点",null,null,null,null,null,null,null,null,"得点",null,null,null,null,null,null,null,null,"得点",null,null,null,null,null,null,null,null,"得点",null,null,null,null,null,null,null,null,"得点",null,null,null,null,null,null,null,null,"得点",null,null,null,null,null,null,null,null,"得点",null,null,null,null,null,null,null,null,"得点"]
[null,null,null,null,"HR",null,null,null,null,null,null,null,null,"HR",null,null,null,null,null,null,null,null,"HR",null,null,null,null,null,null,null,null,"HR",null,null,null,null,null,null,null,null,"HR",null,null,null,null,null,null,null,null,"HR",null,null,null,null,null,null,null,null,"HR",null,null,null,null,null,null,null,null,"HR"]
[]
[null,null,null,null,"レフリー：",{"$f":"VLOOKUP(C93,【進行】結果入力表!$B$7:$M$78,11,FALSE)","v":{"$error":"#N/A"}},{"$f":"VLOOKUP(C93,【進行】結果入力表!$B$7:$M$78,12,FALSE)","v":{"$error":"#N/A"}},null,null,null,null,null,null,"レフリー：",{"$f":"VLOOKUP(L93,【進行】結果入力表!$B$7:$M$78,11,FALSE)","v":{"$error":"#N/A"}},{"$f":"VLOOKUP(L93,【進行】結果入力表!$B$7:$M$78,12,FALSE)","v":{"$error":"#N/A"}},null,null,null,null,null,null,"レフリー：",{"$f":"VLOOKUP(U93,【進行】結果入力表!$B$7:$M$78,11,FALSE)","v":{"$error":"#N/A"}},{"$f":"VLOOKUP(U93,【進行】結果入力表!$B$7:$M$78,12,FALSE)","v":{"$error":"#N/A"}},null,null,null,null,null,null,"レフリー：",{"$f":"VLOOKUP(AD93,【進行】結果入力表!$B$7:$M$78,11,FALSE)","v":{"$error":"#N/A"}},{"$f":"VLOOKUP(AD93,【進行】結果入力表!$B$7:$M$78,12,FALSE)","v":{"$error":"#N/A"}},null,null,null,null,null,null,"レフリー：",{"$f":"VLOOKUP(AM93,【進行】結果入力表!$B$7:$M$78,11,FALSE)","v":{"$error":"#N/A"}},{"$f":"VLOOKUP(AM93,【進行】結果入力表!$B$7:$M$78,12,FALSE)","v":{"$error":"#N/A"}},null,null,null,null,null,null,"レフリー：",{"$f":"VLOOKUP(AV93,【進行】結果入力表!$B$7:$M$78,11,FALSE)","v":{"$error":"#N/A"}},{"$f":"VLOOKUP(AV93,【進行】結果入力表!$B$7:$M$78,12,FALSE)","v":{"$error":"#N/A"}},null,null,null,null,null,null,"レフリー：",{"$f":"VLOOKUP(BE93,【進行】結果入力表!$B$7:$M$78,11,FALSE)","v":{"$error":"#N/A"}},{"$f":"VLOOKUP(BE93,【進行】結果入力表!$B$7:$M$78,12,FALSE)","v":{"$error":"#N/A"}},null,null,null,null,null,null,"レフリー：",{"$f":"VLOOKUP(BN93,【進行】結果入力表!$B$7:$M$78,11,FALSE)","v":{"$error":"#N/A"}},{"$f":"VLOOKUP(BN93,【進行】結果入力表!$B$7:$M$78,12,FALSE)","v":{"$error":"#N/A"}}]
[]
[]
[]
[]
[null,null,null,null,null,"io"]

{"sheet":"【結果】個人成績表","index":2,"n_rows":35,"n_cols":97,"rows_kept":35,"cut":false,"hidden":false,"merged":[[31,61,31,62],[32,61,32,62],[33,61,33,62],[28,61,28,62],[29,61,29,62],[30,61,30,62],[13,53,13,54],[13,59,13,60],[22,51,22,52],[11,51,11,52],[7,59,7,60],[15,61,15,62],[20,61,20,62],[3,64,3,69],[21,61,21,62],[5,59,5,60],[5,53,5,54],[6,53,6,54],[27,61,27,62],[23,61,23,62],[24,61,24,62],[25,61,25,62],[26,61,26,62],[16,61,16,62],[17,61,17,62],[18,61,18,62],[22,61,22,62],[12,61,12,62],[13,61,13,62],[14,61,14,62],[19,61,19,62],[4,61,4,62],[5,61,5,62],[6,61,6,62],[7,61,7,62],[8,61,8,62],[11,61,11,62],[9,61,9,62],[10,61,10,62],[31,49,31,50],[27,41,27,42],[15,43,15,44],[33,51,33,52],[12,51,12,52],[31,51,31,52],[32,51,32,52],[27,43,27,44],[15,41,15,42],[25,41,25,42],[26,51,26,52],[20,43,20,44],[20,41,20,42],[13,49,13,50],[23,51,23,52],[13,51,13,52],[14,51,14,52],[11,23,11,24],[31,41,31,42],[12,41,12,42],[16,41,16,42],[17,41,17,42],[31,39,31,40],[26,21,26,22],[7,41,7,42],[8,41,8,42],[9,41,9,42],[10,41,10,42],[9,21,9,22],[7,23,7,24],[7,39,7,40],[8,23,8,24],[24,39,24,40],[27,31,27,32],[30,39,30,40],[30,33,30,34],[27,39,27,40],[27,33,27,34],[31,33,31,34],[28,41,28,42],[29,41,29,42],[12,11,12,12],[13,21,13,22],[13,11,13,12],[26,13,26,14],[26,31,26,32],[20,21,20,22],[15,29,15,30],[15,31,15,32],[16,23,16,24],[23,13,23,14],[25,31,25,32],[23,31,23,32],[23,19,23,20],[12,23,12,24],[13,23,13,24],[19,21,19,22],[12,13,12,14],[27,11,27,12],[28,11,28,12],[4,21,4,22],[5,21,5,22],[6,21,6,22],[7,21,7,22],[25,11,25,12],[23,21,23,22],[13,19,13,20],[10,21,10,22],[11,13,11,14],[16,21,16,22],[17,21,17,22],[21,21,21,22],[10,19,10,20],[13,13,13,14],[11,11,11,12],[14,21,14,22],[15,21,15,22],[11,19,11,20],[12,19,12,20],[11,21,11,22],[12,21,12,22],[24,0,33,0],[12,1,12,3],[8,1,8,3],[9,1,9,3],[10,1,10,3],[11,1,11,3],[13,1,13,3],[14,1,14,3],[18,1,18,3],[19,1,19,3],[4,0,13,0],[14,0,23,0],[4,1,4,3],[5,1,5,3],[6,1,6,3],[7,1,7,3],[20,1,20,3],[21,1,21,3],[23,1,23,3],[16,1,16,3],[17,1,17,3],[12,5,12,6],[6,5,6,6],[7,5,7,6],[4,5,4,6],[5,5,5,6],[13,5,13,6],[4,13,4,14],[5,9,5,10],[6,9,6,10],[7,9,7,10],[8,9,8,10],[6,11,6,12],[7,11,7,12],[9,9,9,10],[4,9,4,10],[9,11,9,12],[8,5,8,6],[9,5,9,6],[11,9,11,10],[12,9,12,10],[13,9,13,10],[10,5,10,6],[11,5,11,6],[4,11,4,12],[10,9,10,10],[7,13,7,14],[8,13,8,14],[9,13,9,14],[10,13,10,14],[10,11,10,12],[8,11,8,12],[4,19,4,20],[5,13,5,14],[6,13,6,14],[5,19,5,20],[6,19,6,20],[5,11,5,12],[5,23,5,24],[6,23,6,24],[7,29,7,30],[9,29,9,30],[8,19,8,20],[9,19,9,20],[6,29,6,30],[7,19,7,20],[9,23,9,24],[8,21,8,22],[5,39,5,40],[5,33,5,34],[6,49,6,50],[5,31,5,32],[6,31,6,32],[6,41,6,42],[5,41,5,42],[13,29,13,30],[8,39,8,40],[9,33,9,34],[8,33,8,34],[5,29,5,30],[12,39,12,40],[8,29,8,30],[7,31,7,32],[7,33,7,34],[8,31,8,32],[6,39,6,40],[6,33,6,34],[8,43,8,44],[8,49,8,50],[11,49,11,50],[11,41,11,42],[4,23,4,24],[4,29,4,30],[4,33,4,34],[4,39,4,40],[4,31,4,32],[4,53,4,54],[4,51,4,52],[4,49,4,50],[4,43,4,44],[4,41,4,42],[4,59,4,60],[7,53,7,54],[6,43,6,44],[5,49,5,50],[6,59,6,60],[7,51,7,52],[7,43,7,44],[7,49,7,50],[5,43,5,44],[5,51,5,52],[6,51,6,52],[8,59,8,60],[8,51,8,52],[9,59,9,60],[9,51,9,52],[9,43,9,44],[10,23,10,24],[10,39,10,40],[10,43,10,44],[10,49,10,50],[9,31,9,32],[8,53,8,54],[10,53,10,54],[9,53,9,54],[10,59,10,60],[10,51,10,52],[10,31,10,32],[9,49,9,50],[10,33,10,34],[9,39,9,40],[10,29,10,30],[11,33,11,34],[11,29,11,30],[11,31,11,32],[11,39,11,40],[12,31,12,32],[12,33,12,34],[12,29,12,30],[11,59,11,60],[12,43,12,44],[12,49,12,50],[12,53,12,54],[12,59,12,60],[11,43,11,44],[11,53,11,54],[13,43,13,44],[13,41,13,42],[14,41,14,42],[14,5,14,6],[14,19,14,20],[14,13,14,14],[14,9,14,10],[14,23,14,24],[14,33,14,34],[14,29,14,30],[14,31,14,32],[14,11,14,12],[15,1,15,3],[15,5,15,6],[15,19,15,20],[15,13,15,14],[15,9,15,10],[15,23,15,24],[15,11,15,12],[13,33,13,34],[13,39,13,40],[13,31,13,32],[14,39,14,40],[15,33,15,34],[16,39,16,40],[16,33,16,34],[16,49,16,50],[16,51,16,52],[14,59,14,60],[14,53,14,54],[14,49,14,50],[15,39,15,40],[14,43,14,44],[17,59,17,60],[17,53,17,54],[17,49,17,50],[17,51,17,52],[17,43,17,44],[16,59,16,60],[16,53,16,54],[15,59,15,60],[15,53,15,54],[15,49,15,50],[15,51,15,52],[17,5,17,6],[17,19,17,20],[17,13,17,14],[17,9,17,10],[17,11,17,12],[17,23,17,24],[16,29,16,30],[16,31,16,32],[16,43,16,44],[16,5,16,6],[16,19,16,20],[16,13,16,14],[16,9,16,10],[16,11,16,12],[17,29,17,30],[17,31,17,32],[18,33,18,34],[18,29,18,30],[18,31,18,32],[18,43,18,44],[18,41,18,42],[18,39,18,40],[17,39,17,40],[17,33,17,34],[18,49,18,50],[18,51,18,52],[18,5,18,6],[18,19,18,20],[18,13,18,14],[18,9,18,10],[18,11,18,12],[18,59,18,60],[18,53,18,54],[18,23,18,24],[18,21,18,22],[19,43,19,44],[19,41,19,42],[19,23,19,24],[19,39,19,40],[19,33,19,34],[19,59,19,60],[19,53,19,54],[19,49,19,50],[19,51,19,52],[21,33,21,34],[19,29,19,30],[19,31,19,32],[20,23,20,24],[20,39,20,40],[20,33,20,34],[20,29,20,30],[20,31,20,32],[19,5,19,6],[19,19,19,20],[19,13,19,14],[19,9,19,10],[19,11,19,12],[21,29,21,30],[21,31,21,32],[21,5,21,6],[21,19,21,20],[21,13,21,14],[21,9,21,10],[21,11,21,12],[20,59,20,60],[20,53,20,54],[21,59,21,60],[21,53,21,54],[21,49,21,50],[21,51,21,52],[20,49,20,50],[20,51,20,52],[20,5,20,6],[20,19,20,20],[20,13,20,14],[20,9,20,10],[20,11,20,12],[21,43,21,44],[21,41,21,42],[21,23,21,24],[21,39,21,40],[22,23,22,24],[22,29,22,30],[22,1,22,3],[22,5,22,6],[22,19,22,20],[22,13,22,14],[22,9,22,10],[22,11,22,12],[22,21,22,22],[23,5,23,6],[23,59,23,60],[23,43,23,44],[23,49,23,50],[23,41,23,42],[23,53,23,54],[23,9,23,10],[23,23,23,24],[23,29,23,30],[23,11,23,12],[22,59,22,60],[22,53,22,54],[24,31,24,32],[22,41,22,42],[22,43,22,44],[23,33,23,34],[23,39,23,40],[22,31,22,32],[22,39,22,40],[22,33,22,34],[24,41,24,42],[22,49,22,50],[24,1,24,3],[24,5,24,6],[24,19,24,20],[24,13,24,14],[24,9,24,10],[24,11,24,12],[25,23,25,24],[24,29,24,30],[25,39,25,40],[24,23,24,24],[24,33,24,34],[25,29,25,30],[25,33,25,34],[24,21,24,22],[25,21,25,22],[24,59,24,60],[24,53,24,54],[24,49,24,50],[24,43,24,44],[25,43,25,44],[24,51,24,52],[25,51,25,52],[26,53,26,54],[26,49,26,50],[25,59,25,60],[25,53,25,54],[25,49,25,50],[26,23,26,24],[26,39,26,40],[26,33,26,34],[26,29,26,30],[26,43,26,44],[26,59,26,60],[25,1,25,3],[25,5,25,6],[25,19,25,20],[25,13,25,14],[25,9,25,10],[26,1,26,3],[26,5,26,6],[26,9,26,10],[26,11,26,12],[26,19,26,20],[26,41,26,42],[27,1,27,3],[27,5,27,6],[27,19,27,20],[27,13,27,14],[27,9,27,10],[27,23,27,24],[27,21,27,22],[27,59,27,60],[27,53,27,54],[27,49,27,50],[27,51,27,52],[29,59,29,60],[29,53,29,54],[29,49,29,50],[29,51,29,52],[28,59,28,60],[28,21,28,22],[27,29,27,30],[28,23,28,24],[28,39,28,40],[28,33,28,34],[28,29,28,30],[28,31,28,32],[28,43,28,44],[29,43,29,44],[28,53,28,54],[28,49,28,50],[28,51,28,52],[29,1,29,3],[29,5,29,6],[29,19,29,20],[29,13,29,14],[29,9,29,10],[29,11,29,12],[28,1,28,3],[28,5,28,6],[28,19,28,20],[28,13,28,14],[28,9,28,10],[30,51,30,52],[30,41,30,42],[30,1,30,3],[30,5,30,6],[30,19,30,20],[30,13,30,14],[30,9,30,10],[30,11,30,12],[29,23,29,24],[29,39,29,40],[29,33,29,34],[29,29,29,30],[29,31,29,32],[30,21,30,22],[30,23,30,24],[29,21,29,22],[30,43,30,44],[31,9,31,10],[31,11,31,12],[31,1,31,3],[31,5,31,6],[31,29,31,30],[31,31,31,32],[31,19,31,20],[31,13,31,14],[30,29,30,30],[30,31,30,32],[31,21,31,22],[33,1,33,3],[33,5,33,6],[33,19,33,20],[33,13,33,14],[33,9,33,10],[33,11,33,12],[32,59,32,60],[32,53,32,54],[32,9,32,10],[32,23,32,24],[32,39,32,40],[32,33,32,34],[32,21,32,22],[32,1,32,3],[32,5,32,6],[32,19,32,20],[32,13,32,14],[32,11,32,12],[33,21,33,22],[1,64,1,69],[33,49,33,50],[33,29,33,30],[33,53,33,54],[33,59,33,60],[33,43,33,44],[31,43,31,44],[31,59,31,60],[31,53,31,54],[33,33,33,34],[33,39,33,40],[32,49,32,50],[33,23,33,24],[32,29,32,30],[32,43,32,44],[32,31,32,32],[33,31,33,32],[32,41,32,42],[33,41,33,42],[31,23,31,24],[30,59,30,60],[30,53,30,54],[30,49,30,50]]}
[{"$f":"【準備】登録!D2&【準備】登録!E2&【準備】登録!F2&\"　\"&【準備】登録!G2&【準備】登録!I2&\"　　　\"&\"(\"&【準備】登録!K6&\"；\"&【準備】登録!D6&\")\"","v":"第9回　神奈滋対抗戦　　　(奈良；キングスポット)"}]
[null,null,null,null,null,null,null,null,null,null,null,null,null,null,null,null,null,null,null,null,null,null,null,null,null,null,null,null,null,null,null,null,null,null,null,null,null,null,null,null,null,null,null,null,null,null,null,null,null,null,null,null,null,null,null,null,null,null,null,null,null,null,null,null,{"$f":"【準備】登録!D4","v":"2021-03-21"}]
[]
[null,null,null,null,null,null,null,null,1,null,null,"st Section",null,null,null,null,null,null,null,null,null,null,null,null,null,null,1,null,2,null,null,"nd Section",null,null,null,null,null,null,null,null,null,null,null,null,null,null,null,null,3,null,null,"rd Section",null,null,null,null,null,null,null,null,null,null,null,"順","HR記録",null,null,null,null,null,null,"HR",null,null,"HR_Point","Rank","氏名","クラブ","MAX",null,"途中経過"]
[{"$f":"IF(【準備】登録!B11=\"\",\"\",【準備】登録!B11)","v":"SBC"},"選手名",null,null,"持点",{"$f":"A15","v":"HRC"},null,"W","L","TP",null,"TP",null,{"$f":"A25","v":"NRC"},null,"W","L","W","L","TP",null,"TP",null,{"$f":"F5","v":"HRC"},null,"W","L","W","L","TP",null,"TP",null,{"$f":"N5","v":"NRC"},null,"W","L","W","L","TP",null,"TP",null,{"$f":"F5","v":"HRC"},null,"W","L","W","L","TP",null,"TP",null,{"$f":"N5","v":"NRC"},null,"W","L","W","L","TP",null,"TP",null,"R","1G","2G","3G","4G","5G","6G",null,"A","B","P",null,null,null,null,null,null,"W","L","TP","R_P",null,null,"MVP、VP",null,null,null,"LP"]
[null,{"$f":"IF(【準備】登録!AK21=0,\"\",【準備】登録!AK21)","v":"林　秀忠"},null,null,{"$f":"【準備】登録!F11","v":180},{"$f":"IF(ISERROR(VLOOKUP($B6&$I$4&F$5,【進行】結果入力表!$Q$7:$V$150,2,FALSE)),\"\",VLOOKUP($B6&$I$4&F$5,【進行】結果入力表!$Q$7:$V$150,2,FALSE))","v":"W"},null,{"$f":"IF(F6=\"\",\"\",IF(F6=\"w\",1,0))","v":1},{"$f":"IF(F6=\"\",\"\",IF(F6=\"w\",0,1))","v":0},{"$f":"IF(F6=\"\",\"\",IF(F6=\"w\",E6,F6))","v":180},null,{"$f":"IF($F6=\"\",\"\",J6/$E6*180)","v":180},null,{"$f":"IF(ISERROR(VLOOKUP($B6&$I$4&N$5,【進行】結果入力表!$Q$7:$V$150,2,FALSE)),\"\",VLOOKUP($B6&$I$4&N$5,【進行】結果入力表!$Q$7:$V$150,2,FALSE))","v":"W"},null,{"$f":"IF(N6=\"\",\"\",IF(N6=\"w\",1,0))","v":1},{"$f":"IF(N6=\"\",\"\",IF(N6=\"w\",0,1))","v":0},{"$f":"IF(N6=\"\",\"\",SUM(H6,P6))","v":2},{"$f":"IF(N6=\"\",\"\",SUM(I6,Q6))","v":0},{"$f":"IF(N6=\"\",\"\",IF(N6=\"w\",E6+J6,N6+J6))","v":360},null,{"$f":"IF($N6=\"\",\"\",T6/$E6*180)","v":360},null,{"$f":"IF(ISERROR(VLOOKUP($B6&$AC$4&X$5,【進行】結果入力表!$Q$7:$V$150,2,FALSE)),\"\",VLOOKUP($B6&$AC$4&X$5,【進行】結果入力表!$Q$7:$V$150,2,FALSE))","v":154},null,{"$f":"IF(X6=\"\",\"\",IF(X6=\"w\",1,0))","v":0},{"$f":"IF(X6=\"\",\"\",IF(X6=\"w\",0,1))","v":1},{"$f":"IF(X6=\"\",\"\",SUM(R6,Z6))","v":2},{"$f":"IF(X6=\"\",\"\",SUM(S6,AA6))","v":1},{"$f":"IF(X6=\"\",\"\",IF(X6=\"w\",T6+E6,X6+T6))","v":514},null,{"$f":"IF($X6=\"\",\"\",AD6/$E6*180)","v":514},null,{"$f":"IF(ISERROR(VLOOKUP($B6&$AC$4&AH$5,【進行】結果入力表!$Q$7:$V$150,2,FALSE)),\"\",VLOOKUP($B6&$AC$4&AH$5,【進行】結果入力表!$Q$7:$V$150,2,FALSE))","v":"W"},null,{"$f":"IF(AH6=\"\",\"\",IF(AH6=\"w\",1,0))","v":1},{"$f":"IF(AH6=\"\",\"\",IF(AH6=\"w\",0,1))","v":0},{"$f":"IF(AH6=\"\",\"\",SUM(AB6,AJ6))","v":3},{"$f":"IF(AH6=\"\",\"\",SUM(AC6,AK6))","v":1},{"$f":"IF(AH6=\"\",\"\",IF(AH6=\"w\",AD6+E6,AH6+AD6))","v":694},null,{"$f":"IF($AH6=\"\",\"\",AN6/$E6*180)","v":694},null,{"$f":"IF(ISERROR(VLOOKUP($B6&$AW$4&AR$5,【進行】結果入力表!$Q$7:$V$150,2,FALSE)),\"\",VLOOKUP($B6&$AW$4&AR$5,【進行】結果入力表!$Q$7:$V$150,2,FALSE))","v":"W"},null,{"$f":"IF(AR6=\"\",\"\",IF(AR6=\"w\",1,0))","v":1},{"$f":"IF(AR6=\"\",\"\",IF(AR6=\"w\",0,1))","v":0},{"$f":"IF(AR6=\"\",\"\",IF(AR6=\"w\",AL6+1,AL6))","v":4},{"$f":"IF(AR6=\"\",\"\",IF(AR6=\"w\",AM6,AM6+1))","v":1},{"$f":"IF(AR6=\"\",\"\",IF(AR6=\"w\",AN6+E6,AR6+AN6))","v":874},null,{"$f":"IF($AR6=\"\",\"\",AX6/$E6*180)","v":873.99999999999989},null,{"$f":"IF(ISERROR(VLOOKUP($B6&$AW$4&BB$5,【進行】結果入力表!$Q$7:$V$150,2,FALSE)),\"\",VLOOKUP($B6&$AW$4&BB$5,【進行】結果入力表!$Q$7:$V$150,2,FALSE))","v":"W"},null,{"$f":"IF(BB6=\"\",\"\",IF(BB6=\"w\",1,0))","v":1},{"$f":"IF(BB6=\"\",\"\",IF(BB6=\"w\",0,1))","v":0},{"$f":"IF(BB6=\"\",\"\",IF(BB6=\"w\",AV6+1,AV6))","v":5},{"$f":"IF(BB6=\"\",\"\",IF(BB6=\"w\",AW6,AW6+1))","v":1},{"$f":"IF(BB6=\"\",\"\",IF(BB6=\"w\",AX6+E6,BB6+AX6))","v":1054},null,{"$f":"IF($BB6=\"\",\"\",BH6/$E6*180)","v":1054},null,{"$f":"IF(SUM(H6:I6)=0,\"\",IF(B$13=\"\",RANK($CF$6:$CF$13,$CF$6:$CF$13,0),RANK($CF$6:$CF$13,$CF$6:$CF$13,0)))","v":1},{"$f":"IF(ISERROR(VLOOKUP($B6&$I$4&F$5,【進行】結果入力表!$Q$7:$V$150,3,FALSE)),\"\",VLOOKUP($B6&$I$4&F$5,【進行】結果入力表!$Q$7:$V$150,3,FALSE))","v":""},{"$f":"IF(ISERROR(VLOOKUP($B6&$I$4&N$5,【進行】結果入力表!$Q$7:$V$150,3,FALSE)),\"\",VLOOKUP($B6&$I$4&N$5,【進行】結果入力表!$Q$7:$V$150,3,FALSE))","v":""},{"$f":"IF(ISERROR(VLOOKUP($B6&$AC$4&X$5,【進行】結果入力表!$Q$7:$V$150,3,FALSE)),\"\",VLOOKUP($B6&$AC$4&X$5,【進行】結果入力表!$Q$7:$V$150,3,FALSE))","v":""},{"$f":"IF(ISERROR(VLOOKUP($B6&$AC$4&AH$5,【進行】結果入力表!$Q$7:$V$150,3,FALSE)),\"\",VLOOKUP($B6&$AC$4&AH$5,【進行】結果入力表!$Q$7:$V$150,3,FALSE))","v":""},{"$f":"IF(ISERROR(VLOOKUP($B6&$AW$4&AR$5,【進行】結果入力表!$Q$7:$V$150,3,FALSE)),\"\",VLOOKUP($B6&$AW$4&AR$5,【進行】結果入力表!$Q$7:$V$150,3,FALSE))","v":105},{"$f":"IF(ISERROR(VLOOKUP($B6&$AW$4&BB$5,【進行】結果入力表!$Q$7:$V$150,3,FALSE)),\"\",VLOOKUP($B6&$AW$4&BB$5,【進行】結果入力表!$Q$7:$V$150,3,FALSE))","v":""},null,{"$f":"COUNTIF($BM6:$BR6,BT$5)","v":0},0,{"$f":"MAX($BM6:$BR6)","v":105},{"$f":"BT6*10000+BU6*1000+BV6","v":105},{"$f":"RANK(BW6,$BW$6:$BW$33)","v":4},{"$f":"B6","v":"林　秀忠"},{"$f":"$A$5","v":"SBC"},{"$f":"IF(BT6>0,\"A\"&E6,IF(BU6>0,\"B\"&E6,BV6))","v":105},null,{"$f":"COUNTIF(F6:BC6,\"w\")","v":5},{"$f":"COUNT(F6,N6,AH6,X6,AR6,BB6)","v":1},{"$f":"CC6*180+SUM(F6,N6,AH6,X6,AR6,BB6)*180/E6","v":1054},{"$f":"CC6*100000+CE6","v":501054},null,{"$f":"RANK(CK6,CK6:CK8,1)","v":2},{"$f":"A5","v":"SBC"},{"$f":"VLOOKUP(1,BL6:CF13,14,FALSE)","v":"林　秀忠"},{"$f":"VLOOKUP(1,BL6:CF13,13,FALSE)","v":4},null,{"$f":"【結果】リーグ成績表!I6","v":130},{"$f":"【結果】リーグ成績表!I7","v":43},{"$f":"【結果】リーグ成績表!AE16","v":154},{"$f":"【結果】リーグ成績表!AE17","v":"W"},{"$f":"【結果】リーグ成績表!BA26","v":47},{"$f":"【結果】リーグ成績表!BA27","v":113},{"$f":"SUM(CM6:CR6)","v":487}]
[null,{"$f":"IF(【準備】登録!AK22=0,\"\",【準備】登録!AK22)","v":"秋田　倫央"},null,null,{"$f":"【準備】登録!I11","v":180},{"$f":"IF(ISERROR(VLOOKUP($B7&$I$4&F$5,【進行】結果入力表!$Q$7:$V$150,2,FALSE)),\"\",VLOOKUP($B7&$I$4&F$5,【進行】結果入力表!$Q$7:$V$150,2,FALSE))","v":60},null,0,1,{"$f":"IF(F7=\"\",\"\",IF(F7=\"w\",E7,F7))","v":60},null,60,null,{"$f":"IF(ISERROR(VLOOKUP($B7&$I$4&N$5,【進行】結果入力表!$Q$7:$V$150,2,FALSE)),\"\",VLOOKUP($B7&$I$4&N$5,【進行】結果入力表!$Q$7:$V$150,2,FALSE))","v":46},null,0,1,0,2,{"$f":"IF(N7=\"\",\"\",IF(N7=\"w\",E7+J7,N7+J7))","v":106},null,{"$f":"IF($N7=\"\",\"\",T7/$E7*180)","v":106},null,{"$f":"IF(ISERROR(VLOOKUP($B7&$AC$4&X$5,【進行】結果入力表!$Q$7:$V$150,2,FALSE)),\"\",VLOOKUP($B7&$AC$4&X$5,【進行】結果入力表!$Q$7:$V$150,2,FALSE))","v":"W"},null,1,0,1,2,286,null,286,null,{"$f":"IF(ISERROR(VLOOKUP($B7&$AC$4&AH$5,【進行】結果入力表!$Q$7:$V$150,2,FALSE)),\"\",VLOOKUP($B7&$AC$4&AH$5,【進行】結果入力表!$Q$7:$V$150,2,FALSE))","v":"W"},null,1,0,2,2,466,null,466,null,{"$f":"IF(ISERROR(VLOOKUP($B7&$AW$4&AR$5,【進行】結果入力表!$Q$7:$V$150,2,FALSE)),\"\",VLOOKUP($B7&$AW$4&AR$5,【進行】結果入力表!$Q$7:$V$150,2,FALSE))","v":"W"},null,1,0,3,2,646,null,646,null,{"$f":"IF(ISERROR(VLOOKUP($B7&$AW$4&BB$5,【進行】結果入力表!$Q$7:$V$150,2,FALSE)),\"\",VLOOKUP($B7&$AW$4&BB$5,【進行】結果入力表!$Q$7:$V$150,2,FALSE))","v":168},null,0,1,3,3,814,null,814,null,{"$f":"IF(SUM(H7:I7,R7:S7)=0,\"\",IF(B$13=\"\",RANK($CF$6:$CF$12,$CF$6:$CF$12,0),RANK($CF$6:$CF$13,$CF$6:$CF$13,0)))","v":4},{"$f":"IF(ISERROR(VLOOKUP($B7&$I$4&F$5,【進行】結果入力表!$Q$7:$V$150,3,FALSE)),\"\",VLOOKUP($B7&$I$4&F$5,【進行】結果入力表!$Q$7:$V$150,3,FALSE))","v":""},{"$f":"IF(ISERROR(VLOOKUP($B7&$I$4&N$5,【進行】結果入力表!$Q$7:$V$150,3,FALSE)),\"\",VLOOKUP($B7&$I$4&N$5,【進行】結果入力表!$Q$7:$V$150,3,FALSE))","v":""},{"$f":"IF(ISERROR(VLOOKUP($B7&$AC$4&X$5,【進行】結果入力表!$Q$7:$V$150,3,FALSE)),\"\",VLOOKUP($B7&$AC$4&X$5,【進行】結果入力表!$Q$7:$V$150,3,FALSE))","v":""},{"$f":"IF(ISERROR(VLOOKUP($B7&$AC$4&AH$5,【進行】結果入力表!$Q$7:$V$150,3,FALSE)),\"\",VLOOKUP($B7&$AC$4&AH$5,【進行】結果入力表!$Q$7:$V$150,3,FALSE))","v":""},{"$f":"IF(ISERROR(VLOOKUP($B7&$AW$4&AR$5,【進行】結果入力表!$Q$7:$V$150,3,FALSE)),\"\",VLOOKUP($B7&$AW$4&AR$5,【進行】結果入力表!$Q$7:$V$150,3,FALSE))","v":""},{"$f":"IF(ISERROR(VLOOKUP($B7&$AW$4&BB$5,【進行】結果入力表!$Q$7:$V$150,3,FALSE)),\"\",VLOOKUP($B7&$AW$4&BB$5,【進行】結果入力表!$Q$7:$V$150,3,FALSE))","v":""},null,0,0,0,0,7,"秋田　倫央","SBC",0,null,{"$f":"COUNTIF(F7:BC7,\"w\")","v":3},{"$f":"COUNT(F7,N7,AH7,X7,AR7,BB7)","v":3},{"$f":"CC7*180+SUM(F7,N7,AH7,X7,AR7,BB7)*180/E7","v":814},{"$f":"CC7*100000+CE7","v":300814},null,{"$f":"RANK(CK7,CK6:CK8,1)","v":1},{"$f":"A15","v":"HRC"},{"$f":"VLOOKUP(1,BL16:CF23,14,FALSE)","v":"金井　健太郎"},{"$f":"VLOOKUP(1,BL16:CF23,13,FALSE)","v":2},null,null,null,null,null,null,null,{"$f":"SUM(CM7:CR7)","v":0}]
[null,{"$f":"IF(【準備】登録!AK23=0,\"\",【準備】登録!AK23)","v":"大橋　正寛"},null,null,{"$f":"【準備】登録!L11","v":180},{"$f":"IF(ISERROR(VLOOKUP($B8&$I$4&F$5,【進行】結果入力表!$Q$7:$V$150,2,FALSE)),\"\",VLOOKUP($B8&$I$4&F$5,【進行】結果入力表!$Q$7:$V$150,2,FALSE))","v":"W"},null,1,0,180,null,180,null,{"$f":"IF(ISERROR(VLOOKUP($B8&$I$4&N$5,【進行】結果入力表!$Q$7:$V$150,2,FALSE)),\"\",VLOOKUP($B8&$I$4&N$5,【進行】結果入力表!$Q$7:$V$150,2,FALSE))","v":127},null,0,1,1,1,307,null,307,null,{"$f":"IF(ISERROR(VLOOKUP($B8&$AC$4&X$5,【進行】結果入力表!$Q$7:$V$150,2,FALSE)),\"\",VLOOKUP($B8&$AC$4&X$5,【進行】結果入力表!$Q$7:$V$150,2,FALSE))","v":"W"},null,1,0,2,1,487,null,487,null,{"$f":"IF(ISERROR(VLOOKUP($B8&$AC$4&AH$5,【進行】結果入力表!$Q$7:$V$150,2,FALSE)),\"\",VLOOKUP($B8&$AC$4&AH$5,【進行】結果入力表!$Q$7:$V$150,2,FALSE))","v":"W"},null,1,0,3,1,667,null,667,null,{"$f":"IF(ISERROR(VLOOKUP($B8&$AW$4&AR$5,【進行】結果入力表!$Q$7:$V$150,2,FALSE)),\"\",VLOOKUP($B8&$AW$4&AR$5,【進行】結果入力表!$Q$7:$V$150,2,FALSE))","v":"W"},null,1,0,4,1,847,null,847,null,{"$f":"IF(ISERROR(VLOOKUP($B8&$AW$4&BB$5,【進行】結果入力表!$Q$7:$V$150,2,FALSE)),\"\",VLOOKUP($B8&$AW$4&BB$5,【進行】結果入力表!$Q$7:$V$150,2,FALSE))","v":"W"},null,1,0,5,1,1027,null,1027,null,2,{"$f":"IF(ISERROR(VLOOKUP($B8&$I$4&F$5,【進行】結果入力表!$Q$7:$V$150,3,FALSE)),\"\",VLOOKUP($B8&$I$4&F$5,【進行】結果入力表!$Q$7:$V$150,3,FALSE))","v":""},{"$f":"IF(ISERROR(VLOOKUP($B8&$I$4&N$5,【進行】結果入力表!$Q$7:$V$150,3,FALSE)),\"\",VLOOKUP($B8&$I$4&N$5,【進行】結果入力表!$Q$7:$V$150,3,FALSE))","v":""},{"$f":"IF(ISERROR(VLOOKUP($B8&$AC$4&X$5,【進行】結果入力表!$Q$7:$V$150,3,FALSE)),\"\",VLOOKUP($B8&$AC$4&X$5,【進行】結果入力表!$Q$7:$V$150,3,FALSE))","v":""},{"$f":"IF(ISERROR(VLOOKUP($B8&$AC$4&AH$5,【進行】結果入力表!$Q$7:$V$150,3,FALSE)),\"\",VLOOKUP($B8&$AC$4&AH$5,【進行】結果入力表!$Q$7:$V$150,3,FALSE))","v":""},{"$f":"IF(ISERROR(VLOOKUP($B8&$AW$4&AR$5,【進行】結果入力表!$Q$7:$V$150,3,FALSE)),\"\",VLOOKUP($B8&$AW$4&AR$5,【進行】結果入力表!$Q$7:$V$150,3,FALSE))","v":""},{"$f":"IF(ISERROR(VLOOKUP($B8&$AW$4&BB$5,【進行】結果入力表!$Q$7:$V$150,3,FALSE)),\"\",VLOOKUP($B8&$AW$4&BB$5,【進行】結果入力表!$Q$7:$V$150,3,FALSE))","v":""},null,0,0,0,0,7,"大橋　正寛","SBC",0,null,{"$f":"COUNTIF(F8:BC8,\"w\")","v":5},{"$f":"COUNT(F8,N8,AH8,X8,AR8,BB8)","v":1},{"$f":"CC8*180+SUM(F8,N8,AH8,X8,AR8,BB8)*180/E8","v":1027},{"$f":"CC8*100000+CE8","v":501027},null,{"$f":"RANK(CK8,CK6:CK8,1)","v":3},{"$f":"A25","v":"NRC"},{"$f":"VLOOKUP(1,BL26:CF33,14,FALSE)","v":"金澤　茂昌"},{"$f":"VLOOKUP(1,BL26:CF33,13,FALSE)","v":7},null,null,null,null,null,null,null,0]
[null,{"$f":"IF(【準備】登録!AK24=0,\"\",【準備】登録!AK24)","v":"大橋　義治"},null,null,{"$f":"【準備】登録!O11","v":180},{"$f":"IF(ISERROR(VLOOKUP($B9&$I$4&F$5,【進行】結果入力表!$Q$7:$V$150,2,FALSE)),\"\",VLOOKUP($B9&$I$4&F$5,【進行】結果入力表!$Q$7:$V$150,2,FALSE))","v":"W"},null,1,0,180,null,180,null,{"$f":"IF(ISERROR(VLOOKUP($B9&$I$4&N$5,【進行】結果入力表!$Q$7:$V$150,2,FALSE)),\"\",VLOOKUP($B9&$I$4&N$5,【進行】結果入力表!$Q$7:$V$150,2,FALSE))","v":"W"},null,1,0,2,0,360,null,360,null,{"$f":"IF(ISERROR(VLOOKUP($B9&$AC$4&X$5,【進行】結果入力表!$Q$7:$V$150,2,FALSE)),\"\",VLOOKUP($B9&$AC$4&X$5,【進行】結果入力表!$Q$7:$V$150,2,FALSE))","v":"W"},null,1,0,3,0,540,null,540,null,{"$f":"IF(ISERROR(VLOOKUP($B9&$AC$4&AH$5,【進行】結果入力表!$Q$7:$V$150,2,FALSE)),\"\",VLOOKUP($B9&$AC$4&AH$5,【進行】結果入力表!$Q$7:$V$150,2,FALSE))","v":"W"},null,1,0,4,0,720,null,720,null,{"$f":"IF(ISERROR(VLOOKUP($B9&$AW$4&AR$5,【進行】結果入力表!$Q$7:$V$150,2,FALSE)),\"\",VLOOKUP($B9&$AW$4&AR$5,【進行】結果入力表!$Q$7:$V$150,2,FALSE))","v":91},null,0,1,4,1,811,null,811,null,{"$f":"IF(ISERROR(VLOOKUP($B9&$AW$4&BB$5,【進行】結果入力表!$Q$7:$V$150,2,FALSE)),\"\",VLOOKUP($B9&$AW$4&BB$5,【進行】結果入力表!$Q$7:$V$150,2,FALSE))","v":"W"},null,1,0,5,1,991,null,991,null,3,{"$f":"IF(ISERROR(VLOOKUP($B9&$I$4&F$5,【進行】結果入力表!$Q$7:$V$150,3,FALSE)),\"\",VLOOKUP($B9&$I$4&F$5,【進行】結果入力表!$Q$7:$V$150,3,FALSE))","v":""},{"$f":"IF(ISERROR(VLOOKUP($B9&$I$4&N$5,【進行】結果入力表!$Q$7:$V$150,3,FALSE)),\"\",VLOOKUP($B9&$I$4&N$5,【進行】結果入力表!$Q$7:$V$150,3,FALSE))","v":""},{"$f":"IF(ISERROR(VLOOKUP($B9&$AC$4&X$5,【進行】結果入力表!$Q$7:$V$150,3,FALSE)),\"\",VLOOKUP($B9&$AC$4&X$5,【進行】結果入力表!$Q$7:$V$150,3,FALSE))","v":""},{"$f":"IF(ISERROR(VLOOKUP($B9&$AC$4&AH$5,【進行】結果入力表!$Q$7:$V$150,3,FALSE)),\"\",VLOOKUP($B9&$AC$4&AH$5,【進行】結果入力表!$Q$7:$V$150,3,FALSE))","v":""},{"$f":"IF(ISERROR(VLOOKUP($B9&$AW$4&AR$5,【進行】結果入力表!$Q$7:$V$150,3,FALSE)),\"\",VLOOKUP($B9&$AW$4&AR$5,【進行】結果入力表!$Q$7:$V$150,3,FALSE))","v":""},{"$f":"IF(ISERROR(VLOOKUP($B9&$AW$4&BB$5,【進行】結果入力表!$Q$7:$V$150,3,FALSE)),\"\",VLOOKUP($B9&$AW$4&BB$5,【進行】結果入力表!$Q$7:$V$150,3,FALSE))","v":""},null,0,0,0,0,7,"大橋　義治","SBC",0,null,{"$f":"COUNTIF(F9:BC9,\"w\")","v":5},{"$f":"COUNT(F9,N9,AH9,X9,AR9,BB9)","v":1},{"$f":"CC9*180+SUM(F9,N9,AH9,X9,AR9,BB9)*180/E9","v":991},{"$f":"CC9*100000+CE9","v":500991},null,null,null,null,null,null,null,null,null,null,null,null,0]
[null,{"$f":"IF(【準備】登録!AK25=0,\"\",【準備】登録!AK25)","v":"山中　康寛"},null,null,{"$f":"【準備】登録!R11","v":180},{"$f":"IF(ISERROR(VLOOKUP($B10&$I$4&F$5,【進行】結果入力表!$Q$7:$V$150,2,FALSE)),\"\",VLOOKUP($B10&$I$4&F$5,【進行】結果入力表!$Q$7:$V$150,2,FALSE))","v":92},null,0,1,92,null,92,null,{"$f":"IF(ISERROR(VLOOKUP($B10&$I$4&N$5,【進行】結果入力表!$Q$7:$V$150,2,FALSE)),\"\",VLOOKUP($B10&$I$4&N$5,【進行】結果入力表!$Q$7:$V$150,2,FALSE))","v":"W"},null,1,0,1,1,272,null,272,null,{"$f":"IF(ISERROR(VLOOKUP($B10&$AC$4&X$5,【進行】結果入力表!$Q$7:$V$150,2,FALSE)),\"\",VLOOKUP($B10&$AC$4&X$5,【進行】結果入力表!$Q$7:$V$150,2,FALSE))","v":"W"},null,1,0,2,1,452,null,452,null,{"$f":"IF(ISERROR(VLOOKUP($B10&$AC$4&AH$5,【進行】結果入力表!$Q$7:$V$150,2,FALSE)),\"\",VLOOKUP($B10&$AC$4&AH$5,【進行】結果入力表!$Q$7:$V$150,2,FALSE))","v":164},null,0,1,2,2,616,null,616,null,{"$f":"IF(ISERROR(VLOOKUP($B10&$AW$4&AR$5,【進行】結果入力表!$Q$7:$V$150,2,FALSE)),\"\",VLOOKUP($B10&$AW$4&AR$5,【進行】結果入力表!$Q$7:$V$150,2,FALSE))","v":37},null,0,1,2,3,653,null,653,null,{"$f":"IF(ISERROR(VLOOKUP($B10&$AW$4&BB$5,【進行】結果入力表!$Q$7:$V$150,2,FALSE)),\"\",VLOOKUP($B10&$AW$4&BB$5,【進行】結果入力表!$Q$7:$V$150,2,FALSE))","v":83},null,0,1,2,4,736,null,736,null,6,{"$f":"IF(ISERROR(VLOOKUP($B10&$I$4&F$5,【進行】結果入力表!$Q$7:$V$150,3,FALSE)),\"\",VLOOKUP($B10&$I$4&F$5,【進行】結果入力表!$Q$7:$V$150,3,FALSE))","v":""},{"$f":"IF(ISERROR(VLOOKUP($B10&$I$4&N$5,【進行】結果入力表!$Q$7:$V$150,3,FALSE)),\"\",VLOOKUP($B10&$I$4&N$5,【進行】結果入力表!$Q$7:$V$150,3,FALSE))","v":""},{"$f":"IF(ISERROR(VLOOKUP($B10&$AC$4&X$5,【進行】結果入力表!$Q$7:$V$150,3,FALSE)),\"\",VLOOKUP($B10&$AC$4&X$5,【進行】結果入力表!$Q$7:$V$150,3,FALSE))","v":""},{"$f":"IF(ISERROR(VLOOKUP($B10&$AC$4&AH$5,【進行】結果入力表!$Q$7:$V$150,3,FALSE)),\"\",VLOOKUP($B10&$AC$4&AH$5,【進行】結果入力表!$Q$7:$V$150,3,FALSE))","v":""},{"$f":"IF(ISERROR(VLOOKUP($B10&$AW$4&AR$5,【進行】結果入力表!$Q$7:$V$150,3,FALSE)),\"\",VLOOKUP($B10&$AW$4&AR$5,【進行】結果入力表!$Q$7:$V$150,3,FALSE))","v":""},{"$f":"IF(ISERROR(VLOOKUP($B10&$AW$4&BB$5,【進行】結果入力表!$Q$7:$V$150,3,FALSE)),\"\",VLOOKUP($B10&$AW$4&BB$5,【進行】結果入力表!$Q$7:$V$150,3,FALSE))","v":""},null,0,0,0,0,7,"山中　康寛","SBC",0,null,{"$f":"COUNTIF(F10:BC10,\"w\")","v":2},{"$f":"COUNT(F10,N10,AH10,X10,AR10,BB10)","v":4},{"$f":"CC10*180+SUM(F10,N10,AH10,X10,AR10,BB10)*180/E10","v":736},{"$f":"CC10*100000+CE10","v":200736},null,null,null,null,null,null,{"$f":"【結果】リーグ成績表!I26","v":"W"},{"$f":"【結果】リーグ成績表!I27","v":153},{"$f":"【結果】リーグ成績表!AE36","v":""},{"$f":"【結果】リーグ成績表!AE37","v":""},{"$f":"【結果】リーグ成績表!BA11","v":88},{"$f":"【結果】リーグ成績表!BA12","v":"W"},241]
[null,{"$f":"IF(【準備】登録!AK26=0,\"\",【準備】登録!AK26)","v":"大橋　洋子"},null,null,{"$f":"IF(【準備】登録!U11=\"\",\"\",【準備】登録!U11)","v":140},{"$f":"IF(ISERROR(VLOOKUP($B11&$I$4&F$5,【進行】結果入力表!$Q$7:$V$150,2,FALSE)),\"\",VLOOKUP($B11&$I$4&F$5,【進行】結果入力表!$Q$7:$V$150,2,FALSE))","v":"W"},null,1,0,140,null,180,null,{"$f":"IF(ISERROR(VLOOKUP($B11&$I$4&N$5,【進行】結果入力表!$Q$7:$V$150,2,FALSE)),\"\",VLOOKUP($B11&$I$4&N$5,【進行】結果入力表!$Q$7:$V$150,2,FALSE))","v":116},null,0,1,1,1,256,null,329.14285714285711,null,{"$f":"IF(ISERROR(VLOOKUP($B11&$AC$4&X$5,【進行】結果入力表!$Q$7:$V$150,2,FALSE)),\"\",VLOOKUP($B11&$AC$4&X$5,【進行】結果入力表!$Q$7:$V$150,2,FALSE))","v":59},null,0,1,1,2,315,null,405,null,{"$f":"IF(ISERROR(VLOOKUP($B11&$AC$4&AH$5,【進行】結果入力表!$Q$7:$V$150,2,FALSE)),\"\",VLOOKUP($B11&$AC$4&AH$5,【進行】結果入力表!$Q$7:$V$150,2,FALSE))","v":35},null,0,1,1,3,350,null,450,null,{"$f":"IF(ISERROR(VLOOKUP($B11&$AW$4&AR$5,【進行】結果入力表!$Q$7:$V$150,2,FALSE)),\"\",VLOOKUP($B11&$AW$4&AR$5,【進行】結果入力表!$Q$7:$V$150,2,FALSE))","v":"W"},null,1,0,2,3,490,null,630,null,{"$f":"IF(ISERROR(VLOOKUP($B11&$AW$4&BB$5,【進行】結果入力表!$Q$7:$V$150,2,FALSE)),\"\",VLOOKUP($B11&$AW$4&BB$5,【進行】結果入力表!$Q$7:$V$150,2,FALSE))","v":111},null,0,1,2,4,601,null,772.71428571428567,null,5,{"$f":"IF(ISERROR(VLOOKUP($B11&$I$4&F$5,【進行】結果入力表!$Q$7:$V$150,3,FALSE)),\"\",VLOOKUP($B11&$I$4&F$5,【進行】結果入力表!$Q$7:$V$150,3,FALSE))","v":""},{"$f":"IF(ISERROR(VLOOKUP($B11&$I$4&N$5,【進行】結果入力表!$Q$7:$V$150,3,FALSE)),\"\",VLOOKUP($B11&$I$4&N$5,【進行】結果入力表!$Q$7:$V$150,3,FALSE))","v":""},{"$f":"IF(ISERROR(VLOOKUP($B11&$AC$4&X$5,【進行】結果入力表!$Q$7:$V$150,3,FALSE)),\"\",VLOOKUP($B11&$AC$4&X$5,【進行】結果入力表!$Q$7:$V$150,3,FALSE))","v":""},{"$f":"IF(ISERROR(VLOOKUP($B11&$AC$4&AH$5,【進行】結果入力表!$Q$7:$V$150,3,FALSE)),\"\",VLOOKUP($B11&$AC$4&AH$5,【進行】結果入力表!$Q$7:$V$150,3,FALSE))","v":""},{"$f":"IF(ISERROR(VLOOKUP($B11&$AW$4&AR$5,【進行】結果入力表!$Q$7:$V$150,3,FALSE)),\"\",VLOOKUP($B11&$AW$4&AR$5,【進行】結果入力表!$Q$7:$V$150,3,FALSE))","v":""},{"$f":"IF(ISERROR(VLOOKUP($B11&$AW$4&BB$5,【進行】結果入力表!$Q$7:$V$150,3,FALSE)),\"\",VLOOKUP($B11&$AW$4&BB$5,【進行】結果入力表!$Q$7:$V$150,3,FALSE))","v":""},null,0,0,0,0,7,"大橋　洋子","SBC",0,null,{"$f":"IF(B11=\"\",\"\",COUNTIF(F11:BC11,\"w\"))","v":2},{"$f":"IF(B11=\"\",\"\",COUNT(F11,N11,AH11,X11,AR11,BB11))","v":4},{"$f":"IF(CC11=\"\",\"\",CC11*180+SUM(F11,N11,AH11,X11,AR11,BB11)*180/E11)","v":772.71428571428578},{"$f":"IF(B11=\"\",\"\",CC11*100000+CE11)","v":200772.71428571429},null,null,null,null,null,null,null,null,null,null,null,null,{"$f":"SUM(CM11:CR11)","v":0}]
[null,{"$f":"IF(【準備】登録!AK27=0,\"\",【準備】登録!AK27)","v":""},null,null,{"$f":"IF(【準備】登録!X11=\"\",\"\",【準備】登録!X11)","v":""},{"$f":"IF(ISERROR(VLOOKUP($B12&$I$4&F$5,【進行】結果入力表!$Q$7:$V$150,2,FALSE)),\"\",VLOOKUP($B12&$I$4&F$5,【進行】結果入力表!$Q$7:$V$150,2,FALSE))","v":""},null,"","","",null,"",null,{"$f":"IF(ISERROR(VLOOKUP($B12&$I$4&N$5,【進行】結果入力表!$Q$7:$V$150,2,FALSE)),\"\",VLOOKUP($B12&$I$4&N$5,【進行】結果入力表!$Q$7:$V$150,2,FALSE))","v":""},null,"","","","","",null,"",null,{"$f":"IF(ISERROR(VLOOKUP($B12&$AC$4&X$5,【進行】結果入力表!$Q$7:$V$150,2,FALSE)),\"\",VLOOKUP($B12&$AC$4&X$5,【進行】結果入力表!$Q$7:$V$150,2,FALSE))","v":""},null,"","","","","",null,"",null,{"$f":"IF(ISERROR(VLOOKUP($B12&$AC$4&AH$5,【進行】結果入力表!$Q$7:$V$150,2,FALSE)),\"\",VLOOKUP($B12&$AC$4&AH$5,【進行】結果入力表!$Q$7:$V$150,2,FALSE))","v":""},null,"","","","","",null,"",null,{"$f":"IF(ISERROR(VLOOKUP($B12&$AW$4&AR$5,【進行】結果入力表!$Q$7:$V$150,2,FALSE)),\"\",VLOOKUP($B12&$AW$4&AR$5,【進行】結果入力表!$Q$7:$V$150,2,FALSE))","v":""},null,"","","","","",null,"",null,{"$f":"IF(ISERROR(VLOOKUP($B12&$AW$4&BB$5,【進行】結果入力表!$Q$7:$V$150,2,FALSE)),\"\",VLOOKUP($B12&$AW$4&BB$5,【進行】結果入力表!$Q$7:$V$150,2,FALSE))","v":""},null,"","","","","",null,"",null,"",{"$f":"IF(ISERROR(VLOOKUP($B12&$I$4&F$5,【進行】結果入力表!$Q$7:$V$150,3,FALSE)),\"\",VLOOKUP($B12&$I$4&F$5,【進行】結果入力表!$Q$7:$V$150,3,FALSE))","v":""},{"$f":"IF(ISERROR(VLOOKUP($B12&$I$4&N$5,【進行】結果入力表!$Q$7:$V$150,3,FALSE)),\"\",VLOOKUP($B12&$I$4&N$5,【進行】結果入力表!$Q$7:$V$150,3,FALSE))","v":""},{"$f":"IF(ISERROR(VLOOKUP($B12&$AC$4&X$5,【進行】結果入力表!$Q$7:$V$150,3,FALSE)),\"\",VLOOKUP($B12&$AC$4&X$5,【進行】結果入力表!$Q$7:$V$150,3,FALSE))","v":""},{"$f":"IF(ISERROR(VLOOKUP($B12&$AC$4&AH$5,【進行】結果入力表!$Q$7:$V$150,3,FALSE)),\"\",VLOOKUP($B12&$AC$4&AH$5,【進行】結果入力表!$Q$7:$V$150,3,FALSE))","v":""},{"$f":"IF(ISERROR(VLOOKUP($B12&$AW$4&AR$5,【進行】結果入力表!$Q$7:$V$150,3,FALSE)),\"\",VLOOKUP($B12&$AW$4&AR$5,【進行】結果入力表!$Q$7:$V$150,3,FALSE))","v":""},{"$f":"IF(ISERROR(VLOOKUP($B12&$AW$4&BB$5,【進行】結果入力表!$Q$7:$V$150,3,FALSE)),\"\",VLOOKUP($B12&$AW$4&BB$5,【進行】結果入力表!$Q$7:$V$150,3,FALSE))","v":""},null,0,0,0,0,7,"","SBC",0,null,{"$f":"IF(B12=\"\",\"\",COUNTIF(F12:BC12,\"w\"))","v":""},{"$f":"IF(B12=\"\",\"\",COUNT(F12,N12,AH12,X12,AR12,BB12))","v":""},{"$f":"IF(CC12=\"\",\"\",CC12*180+SUM(F12,N12,AH12,X12,AR12,BB12)*180/E12)","v":""},{"$f":"IF(B12=\"\",\"\",CC12*100000+CE12)","v":""},null,null,null,null,null,null,null,null,null,null,null,null,0]
[null,{"$f":"IF(【準備】登録!AK28=0,\"\",【準備】登録!AK28)","v":""},null,null,{"$f":"IF(【準備】登録!$Y$11=\"\",\"\",【準備】登録!AA11)","v":""},{"$f":"IF(ISERROR(VLOOKUP($B13&$I$4&F$5,【進行】結果入力表!$Q$7:$V$150,2,FALSE)),\"\",VLOOKUP($B13&$I$4&F$5,【進行】結果入力表!$Q$7:$V$150,2,FALSE))","v":""},null,"","","",null,"",null,{"$f":"IF(ISERROR(VLOOKUP($B13&$I$4&N$5,【進行】結果入力表!$Q$7:$V$150,2,FALSE)),\"\",VLOOKUP($B13&$I$4&N$5,【進行】結果入力表!$Q$7:$V$150,2,FALSE))","v":""},null,"","","","","",null,"",null,{"$f":"IF(ISERROR(VLOOKUP($B13&$AC$4&X$5,【進行】結果入力表!$Q$7:$V$150,2,FALSE)),\"\",VLOOKUP($B13&$AC$4&X$5,【進行】結果入力表!$Q$7:$V$150,2,FALSE))","v":""},null,"","","","","",null,"",null,{"$f":"IF(ISERROR(VLOOKUP($B13&$AC$4&AH$5,【進行】結果入力表!$Q$7:$V$150,2,FALSE)),\"\",VLOOKUP($B13&$AC$4&AH$5,【進行】結果入力表!$Q$7:$V$150,2,FALSE))","v":""},null,"","","","","",null,"",null,{"$f":"IF(ISERROR(VLOOKUP($B13&$AW$4&AR$5,【進行】結果入力表!$Q$7:$V$150,2,FALSE)),\"\",VLOOKUP($B13&$AW$4&AR$5,【進行】結果入力表!$Q$7:$V$150,2,FALSE))","v":""},null,"","","","","",null,"",null,{"$f":"IF(ISERROR(VLOOKUP($B13&$AW$4&BB$5,【進行】結果入力表!$Q$7:$V$150,2,FALSE)),\"\",VLOOKUP($B13&$AW$4&BB$5,【進行】結果入力表!$Q$7:$V$150,2,FALSE))","v":""},null,"","","","","",null,"",null,"",{"$f":"IF(ISERROR(VLOOKUP($B13&$I$4&F$5,【進行】結果入力表!$Q$7:$V$150,3,FALSE)),\"\",VLOOKUP($B13&$I$4&F$5,【進行】結果入力表!$Q$7:$V$150,3,FALSE))","v":""},{"$f":"IF(ISERROR(VLOOKUP($B13&$I$4&N$5,【進行】結果入力表!$Q$7:$V$150,3,FALSE)),\"\",VLOOKUP($B13&$I$4&N$5,【進行】結果入力表!$Q$7:$V$150,3,FALSE))","v":""},{"$f":"IF(ISERROR(VLOOKUP($B13&$AC$4&X$5,【進行】結果入力表!$Q$7:$V$150,3,FALSE)),\"\",VLOOKUP($B13&$AC$4&X$5,【進行】結果入力表!$Q$7:$V$150,3,FALSE))","v":""},{"$f":"IF(ISERROR(VLOOKUP($B13&$AC$4&AH$5,【進行】結果入力表!$Q$7:$V$150,3,FALSE)),\"\",VLOOKUP($B13&$AC$4&AH$5,【進行】結果入力表!$Q$7:$V$150,3,FALSE))","v":""},{"$f":"IF(ISERROR(VLOOKUP($B13&$AW$4&AR$5,【進行】結果入力表!$Q$7:$V$150,3,FALSE)),\"\",VLOOKUP($B13&$AW$4&AR$5,【進行】結果入力表!$Q$7:$V$150,3,FALSE))","v":""},{"$f":"IF(ISERROR(VLOOKUP($B13&$AW$4&BB$5,【進行】結果入力表!$Q$7:$V$150,3,FALSE)),\"\",VLOOKUP($B13&$AW$4&BB$5,【進行】結果入力表!$Q$7:$V$150,3,FALSE))","v":""},null,0,0,0,0,7,"","SBC",0,null,{"$f":"IF(B13=\"\",\"\",COUNTIF(F13:BC13,\"w\"))","v":""},{"$f":"IF(B13=\"\",\"\",COUNT(F13,N13,AH13,X13,AR13,BB13))","v":""},{"$f":"IF(CC13=\"\",\"\",CC13*180+SUM(F13,N13,AH13,X13,AR13,BB13)*180/E13)","v":""},{"$f":"IF(B13=\"\",\"\",CC13*100000+CE13)","v":""},null,null,null,null,null,null,null,null,null,null,null,null,{"$f":"SUM(CM13:CR13)","v":0}]
[null,"Total",null,null,null,null,null,{"$f":"IF(COUNTBLANK(H6:H13)=8,\"\",SUM(H6:H13))","v":4},{"$f":"IF(COUNTBLANK(I6:I13)=8,\"\",SUM(I6:I13))","v":2},{"$f":"IF($B6=\"\",\"\",SUM(J6:J13))","v":832},{"$f":"IF($B6=\"\",\"\",SUM(K6:K13))","v":0},{"$f":"IF(COUNTBLANK(L6:L13)=8,\"\",SUM(L6:L13))","v":872},{"$f":"IF($B6=\"\",\"\",SUM(M6:M13))","v":0},null,null,{"$f":"SUM(P6:P13)","v":3},{"$f":"SUM(Q6:Q13)","v":3},{"$f":"IF(COUNTBLANK(R6:R13)=8,\"\",SUM(H14,P14))","v":7},{"$f":"IF(COUNTBLANK(S6:S13)=8,\"\",SUM(I14,Q14))","v":5},{"$f":"IF($B6=\"\",\"\",SUM(T6:T13))","v":1661},{"$f":"IF($B6=\"\",\"\",SUM(U6:U13))","v":0},{"$f":"IF(COUNTBLANK(V6:V13)=8,\"\",SUM(V6:V13))","v":1734.1428571428571},{"$f":"IF($B6=\"\",\"\",SUM(W6:W13))","v":0},null,null,{"$f":"SUM(Z6:Z13)","v":4},{"$f":"SUM(AA6:AA13)","v":2},{"$f":"IF(COUNTBLANK(AB6:AB13)=8,\"\",SUM(R14,Z14))","v":11},{"$f":"IF(COUNTBLANK(AC6:AC13)=8,\"\",SUM(S14,AA14))","v":7},{"$f":"IF($B6=\"\",\"\",SUM(AD6:AD13))","v":2594},{"$f":"IF($B6=\"\",\"\",SUM(AE6:AE13))","v":0},{"$f":"IF(COUNTBLANK(AF6:AF13)=8,\"\",SUM(AF6:AF13))","v":2684},{"$f":"IF($B6=\"\",\"\",SUM(AG6:AG13))","v":0},null,null,{"$f":"SUM(AJ6:AJ13)","v":4},{"$f":"SUM(AK6:AK13)","v":2},{"$f":"IF(COUNTBLANK(AL6:AL13)=8,\"\",SUM(AB14,AJ14))","v":15},{"$f":"IF(COUNTBLANK(AM6:AM13)=8,\"\",SUM(AC14,AK14))","v":9},{"$f":"IF($B6=\"\",\"\",SUM(AN6:AN13))","v":3513},{"$f":"IF($B6=\"\",\"\",SUM(AO6:AO13))","v":0},{"$f":"IF(COUNTBLANK(AP6:AP13)=8,\"\",SUM(AP6:AP13))","v":3613},{"$f":"IF($B6=\"\",\"\",SUM(AQ6:AQ13))","v":0},null,null,{"$f":"SUM(AT6:AT13)","v":4},{"$f":"SUM(AU6:AU13)","v":2},{"$f":"IF(COUNTBLANK(AV6:AV13)=8,\"\",SUM(AL14,AT14))","v":19},{"$f":"IF(COUNTBLANK(AW6:AW13)=8,\"\",SUM(AM14,AU14))","v":11},{"$f":"IF($B6=\"\",\"\",SUM(AX6:AX13))","v":4321},{"$f":"IF($B6=\"\",\"\",SUM(AY6:AY13))","v":0},{"$f":"IF(COUNTBLANK(AZ6:AZ13)=8,\"\",SUM(AZ6:AZ13))","v":4461},{"$f":"IF($B6=\"\",\"\",SUM(BA6:BA13))","v":0},null,null,{"$f":"SUM(BD6:BD13)","v":3},{"$f":"SUM(BE6:BE13)","v":3},{"$f":"IF(COUNTBLANK(BF6:BF13)=8,\"\",SUM(AV14,BD14))","v":22},{"$f":"IF(COUNTBLANK(BG6:BG13)=8,\"\",SUM(AW14,BE14))","v":14},{"$f":"IF(COUNTIF(BH6:BI13,\"\")=16,\"\",SUM(BH6:BH13))","v":5223},{"$f":"IF($B6=\"\",\"\",SUM(BI6:BI13))","v":0},{"$f":"IF(COUNTBLANK(BJ6:BJ13)=8,\"\",SUM(BJ6:BJ13))","v":5394.7142857142853},{"$f":"IF($B6=\"\",\"\",SUM(BK6:BK13))","v":0},null,null,null,null,null,null,null,null,null,null,null,null,null,null,null,null,null,{"$f":"SUM(CC6:CC13)","v":22},{"$f":"SUM(CD6:CD13)","v":14},{"$f":"SUM(CE6:CE13)","v":5394.7142857142862},{"$f":"SUM(CF6:CF13)","v":2205394.7142857141}]
[{"$f":"IF(【準備】登録!B12=\"\",\"\",【準備】登録!B12)","v":"HRC"},{"$f":"B5","v":"選手名"},null,null,{"$f":"E5","v":"持点"},{"$f":"A5","v":"SBC"},null,"W","L","TP",null,"TP",null,{"$f":"A25","v":"NRC"},null,"W","L","W","L","TP",null,"TP",null,{"$f":"A5","v":"SBC"},null,"W","L","W","L","TP",null,"TP",null,{"$f":"A25","v":"NRC"},null,"W","L","W","L","TP",null,"TP",null,{"$f":"A5","v":"SBC"},null,"W","L","W","L","TP",null,"TP",null,{"$f":"A25","v":"NRC"},null,"W","L","W","L","TP",null,"TP",null,"R",{"$f":"BM$5","v":"1G"},"2G","3G","4G","5G","6G",null,null,null,null,null,null,null,null,null,null,{"$f":"CC$5","v":"W"},{"$f":"CD$5","v":"L"},{"$f":"CE$5","v":"TP"},{"$f":"CF$5","v":"R_P"}]
[null,{"$f":"IF(【準備】登録!AK13=0,\"\",【準備】登録!AK13)","v":"高木　俊行"},null,null,{"$f":"【準備】登録!F12","v":180},{"$f":"IF(ISERROR(VLOOKUP($B16&$I$4&F$15,【進行】結果入力表!$Q$7:$V$150,2,FALSE)),\"\",VLOOKUP($B16&$I$4&F$15,【進行】結果入力表!$Q$7:$V$150,2,FALSE))","v":130},null,{"$f":"IF(F16=\"\",\"\",IF(F16=\"w\",1,0))","v":0},{"$f":"IF(F16=\"\",\"\",IF(F16=\"w\",0,1))","v":1},{"$f":"IF(F16=\"\",\"\",IF(F16=\"w\",E16,F16))","v":130},null,{"$f":"IF($F16=\"\",\"\",J16/$E16*180)","v":130},null,{"$f":"IF(ISERROR(VLOOKUP($B16&$I$4&N$15,【進行】結果入力表!$Q$7:$V$150,2,FALSE)),\"\",VLOOKUP($B16&$I$4&N$15,【進行】結果入力表!$Q$7:$V$150,2,FALSE))","v":"W"},null,{"$f":"IF(N16=\"\",\"\",IF(N16=\"w\",1,0))","v":1},{"$f":"IF(N16=\"\",\"\",IF(N16=\"w\",0,1))","v":0},{"$f":"IF(N16=\"\",\"\",SUM(H16,P16))","v":1},{"$f":"IF(N16=\"\",\"\",SUM(I16,Q16))","v":1},{"$f":"IF(N16=\"\",\"\",IF(N16=\"w\",E16+J16,N16+J16))","v":310},null,{"$f":"IF($N16=\"\",\"\",T16/$E16*180)","v":310},null,{"$f":"IF(ISERROR(VLOOKUP($B16&$AC$4&X$15,【進行】結果入力表!$Q$7:$V$150,2,FALSE)),\"\",VLOOKUP($B16&$AC$4&X$15,【進行】結果入力表!$Q$7:$V$150,2,FALSE))","v":128},null,{"$f":"IF(X16=\"\",\"\",IF(X16=\"w\",1,0))","v":0},{"$f":"IF(X16=\"\",\"\",IF(X16=\"w\",0,1))","v":1},{"$f":"IF(X16=\"\",\"\",SUM(R16,Z16))","v":1},{"$f":"IF(X16=\"\",\"\",SUM(S16,AA16))","v":2},{"$f":"IF(X16=\"\",\"\",IF(X16=\"w\",T16+E16,X16+T16))","v":438},null,{"$f":"IF($X16=\"\",\"\",AD16/$E16*180)","v":437.99999999999994},null,{"$f":"IF(ISERROR(VLOOKUP($B16&$AC$4&AH$15,【進行】結果入力表!$Q$7:$V$150,2,FALSE)),\"\",VLOOKUP($B16&$AC$4&AH$15,【進行】結果入力表!$Q$7:$V$150,2,FALSE))","v":"W"},null,{"$f":"IF(AH16=\"\",\"\",IF(AH16=\"w\",1,0))","v":1},{"$f":"IF(AH16=\"\",\"\",IF(AH16=\"w\",0,1))","v":0},{"$f":"IF(AH16=\"\",\"\",SUM(AB16,AJ16))","v":2},{"$f":"IF(AH16=\"\",\"\",SUM(AC16,AK16))","v":2},{"$f":"IF(AH16=\"\",\"\",IF(AH16=\"w\",AD16+E16,AH16+AD16))","v":618},null,{"$f":"IF($AH16=\"\",\"\",AN16/$E16*180)","v":618},null,{"$f":"IF(ISERROR(VLOOKUP($B16&$AW$4&AR$15,【進行】結果入力表!$Q$7:$V$150,2,FALSE)),\"\",VLOOKUP($B16&$AW$4&AR$15,【進行】結果入力表!$Q$7:$V$150,2,FALSE))","v":47},null,{"$f":"IF(AR16=\"\",\"\",IF(AR16=\"w\",1,0))","v":0},{"$f":"IF(AR16=\"\",\"\",IF(AR16=\"w\",0,1))","v":1},{"$f":"IF(AR16=\"\",\"\",IF(AR16=\"w\",AL16+1,AL16))","v":2},{"$f":"IF(AR16=\"\",\"\",IF(AR16=\"w\",AM16,AM16+1))","v":3},{"$f":"IF(AR16=\"\",\"\",IF(AR16=\"w\",AN16+E16,AR16+AN16))","v":665},null,{"$f":"IF($AR16=\"\",\"\",AX16/$E16*180)","v":665},null,{"$f":"IF(ISERROR(VLOOKUP($B16&$AW$4&BB$15,【進行】結果入力表!$Q$7:$V$150,2,FALSE)),\"\",VLOOKUP($B16&$AW$4&BB$15,【進行】結果入力表!$Q$7:$V$150,2,FALSE))","v":"W"},null,{"$f":"IF(BB16=\"\",\"\",IF(BB16=\"w\",1,0))","v":1},{"$f":"IF(BB16=\"\",\"\",IF(BB16=\"w\",0,1))","v":0},{"$f":"IF(BB16=\"\",\"\",IF(BB16=\"w\",AV16+1,AV16))","v":3},{"$f":"IF(BB16=\"\",\"\",IF(BB16=\"w\",AW16,AW16+1))","v":3},{"$f":"IF(BB16=\"\",\"\",IF(BB16=\"w\",AX16+E16,BB16+AX16))","v":845},null,{"$f":"IF($BB16=\"\",\"\",BH16/$E16*180)","v":845},null,{"$f":"IF(SUM(H16:I16,R16:S16)=0,\"\",IF(B$13=\"\",RANK($CF$16:$CF$22,$CF$16:$CF$22,0),RANK($CF$16:$CF$23,$CF$16:$CF$23,0)))","v":5},{"$f":"IF(ISERROR(VLOOKUP($B16&$I$4&F$15,【進行】結果入力表!$Q$7:$V$150,3,FALSE)),\"\",VLOOKUP($B16&$I$4&F$15,【進行】結果入力表!$Q$7:$V$150,3,FALSE))","v":109},{"$f":"IF(ISERROR(VLOOKUP($B16&$I$4&N$15,【進行】結果入力表!$Q$7:$V$150,3,FALSE)),\"\",VLOOKUP($B16&$I$4&N$15,【進行】結果入力表!$Q$7:$V$150,3,FALSE))","v":""},{"$f":"IF(ISERROR(VLOOKUP($B16&$AC$4&X$15,【進行】結果入力表!$Q$7:$V$150,3,FALSE)),\"\",VLOOKUP($B16&$AC$4&X$15,【進行】結果入力表!$Q$7:$V$150,3,FALSE))","v":""},{"$f":"IF(ISERROR(VLOOKUP($B16&$AC$4&AH$15,【進行】結果入力表!$Q$7:$V$150,3,FALSE)),\"\",VLOOKUP($B16&$AC$4&AH$15,【進行】結果入力表!$Q$7:$V$150,3,FALSE))","v":""},{"$f":"IF(ISERROR(VLOOKUP($B16&$AW$4&AR$15,【進行】結果入力表!$Q$7:$V$150,3,FALSE)),\"\",VLOOKUP($B16&$AW$4&AR$15,【進行】結果入力表!$Q$7:$V$150,3,FALSE))","v":""},{"$f":"IF(ISERROR(VLOOKUP($B16&$AW$4&BB$15,【進行】結果入力表!$Q$7:$V$150,3,FALSE)),\"\",VLOOKUP($B16&$AW$4&BB$15,【進行】結果入力表!$Q$7:$V$150,3,FALSE))","v":""},null,{"$f":"COUNTIF($BM16:$BR16,BT$5)","v":0},0,{"$f":"MAX($BM16:$BR16)","v":109},{"$f":"BT16*10000+BU16*1000+BV16","v":109},{"$f":"RANK(BW16,$BW$6:$BW$33)","v":3},{"$f":"B16","v":"高木　俊行"},{"$f":"$A$15","v":"HRC"},{"$f":"IF(BT16>0,\"A\"&E16,IF(BU16>0,\"B\"&E16,BV16))","v":109},null,{"$f":"COUNTIF(F16:BC16,\"w\")","v":3},{"$f":"COUNT(F16,N16,AH16,X16,AR16,BB16)","v":3},{"$f":"CC16*180+SUM(F16,N16,AH16,X16,AR16,BB16)*180/E16","v":845},{"$f":"CC16*100000+CE16","v":300845},null,null,null,null,null,null,null,null,null,null,null,null,{"$f":"SUM(CM16:CR16)","v":0}]
[null,{"$f":"IF(【準備】登録!AK14=0,\"\",【準備】登録!AK14)","v":"金井　健太郎"},null,null,{"$f":"【準備】登録!I12","v":180},{"$f":"IF(ISERROR(VLOOKUP($B17&$I$4&F$15,【進行】結果入力表!$Q$7:$V$150,2,FALSE)),\"\",VLOOKUP($B17&$I$4&F$15,【進行】結果入力表!$Q$7:$V$150,2,FALSE))","v":"W"},null,1,0,180,null,180,null,{"$f":"IF(ISERROR(VLOOKUP($B17&$I$4&N$15,【進行】結果入力表!$Q$7:$V$150,2,FALSE)),\"\",VLOOKUP($B17&$I$4&N$15,【進行】結果入力表!$Q$7:$V$150,2,FALSE))","v":"W"},null,1,0,2,0,360,null,360,null,{"$f":"IF(ISERROR(VLOOKUP($B17&$AC$4&X$15,【進行】結果入力表!$Q$7:$V$150,2,FALSE)),\"\",VLOOKUP($B17&$AC$4&X$15,【進行】結果入力表!$Q$7:$V$150,2,FALSE))","v":167},null,0,1,2,1,527,null,527,null,{"$f":"IF(ISERROR(VLOOKUP($B17&$AC$4&AH$15,【進行】結果入力表!$Q$7:$V$150,2,FALSE)),\"\",VLOOKUP($B17&$AC$4&AH$15,【進行】結果入力表!$Q$7:$V$150,2,FALSE))","v":"W"},null,1,0,3,1,707,null,707,null,{"$f":"IF(ISERROR(VLOOKUP($B17&$AW$4&AR$15,【進行】結果入力表!$Q$7:$V$150,2,FALSE)),\"\",VLOOKUP($B17&$AW$4&AR$15,【進行】結果入力表!$Q$7:$V$150,2,FALSE))","v":"W"},null,1,0,4,1,887,null,887,null,{"$f":"IF(ISERROR(VLOOKUP($B17&$AW$4&BB$15,【進行】結果入力表!$Q$7:$V$150,2,FALSE)),\"\",VLOOKUP($B17&$AW$4&BB$15,【進行】結果入力表!$Q$7:$V$150,2,FALSE))","v":"W"},null,1,0,5,1,1067,null,1067,null,1,{"$f":"IF(ISERROR(VLOOKUP($B17&$I$4&F$15,【進行】結果入力表!$Q$7:$V$150,3,FALSE)),\"\",VLOOKUP($B17&$I$4&F$15,【進行】結果入力表!$Q$7:$V$150,3,FALSE))","v":""},{"$f":"IF(ISERROR(VLOOKUP($B17&$I$4&N$15,【進行】結果入力表!$Q$7:$V$150,3,FALSE)),\"\",VLOOKUP($B17&$I$4&N$15,【進行】結果入力表!$Q$7:$V$150,3,FALSE))","v":""},{"$f":"IF(ISERROR(VLOOKUP($B17&$AC$4&X$15,【進行】結果入力表!$Q$7:$V$150,3,FALSE)),\"\",VLOOKUP($B17&$AC$4&X$15,【進行】結果入力表!$Q$7:$V$150,3,FALSE))","v":""},{"$f":"IF(ISERROR(VLOOKUP($B17&$AC$4&AH$15,【進行】結果入力表!$Q$7:$V$150,3,FALSE)),\"\",VLOOKUP($B17&$AC$4&AH$15,【進行】結果入力表!$Q$7:$V$150,3,FALSE))","v":""},{"$f":"IF(ISERROR(VLOOKUP($B17&$AW$4&AR$15,【進行】結果入力表!$Q$7:$V$150,3,FALSE)),\"\",VLOOKUP($B17&$AW$4&AR$15,【進行】結果入力表!$Q$7:$V$150,3,FALSE))","v":""},{"$f":"IF(ISERROR(VLOOKUP($B17&$AW$4&BB$15,【進行】結果入力表!$Q$7:$V$150,3,FALSE)),\"\",VLOOKUP($B17&$AW$4&BB$15,【進行】結果入力表!$Q$7:$V$150,3,FALSE))","v":115},null,0,0,115,115,2,"金井　健太郎","HRC",115,null,{"$f":"COUNTIF(F17:BC17,\"w\")","v":5},{"$f":"COUNT(F17,N17,AH17,X17,AR17,BB17)","v":1},{"$f":"CC17*180+SUM(F17,N17,AH17,X17,AR17,BB17)*180/E17","v":1067},{"$f":"CC17*100000+CE17","v":501067},null,null,null,null,null,null,null,null,null,null,null,null,{"$f":"SUM(CM17:CR17)","v":0}]
[null,{"$f":"IF(【準備】登録!AK15=0,\"\",【準備】登録!AK15)","v":"平井　洸志"},null,null,{"$f":"【準備】登録!L12","v":180},{"$f":"IF(ISERROR(VLOOKUP($B18&$I$4&F$15,【進行】結果入力表!$Q$7:$V$150,2,FALSE)),\"\",VLOOKUP($B18&$I$4&F$15,【進行】結果入力表!$Q$7:$V$150,2,FALSE))","v":161},null,0,1,161,null,161,null,{"$f":"IF(ISERROR(VLOOKUP($B18&$I$4&N$15,【進行】結果入力表!$Q$7:$V$150,2,FALSE)),\"\",VLOOKUP($B18&$I$4&N$15,【進行】結果入力表!$Q$7:$V$150,2,FALSE))","v":93},null,0,1,0,2,254,null,254.00000000000003,null,{"$f":"IF(ISERROR(VLOOKUP($B18&$AC$4&X$15,【進行】結果入力表!$Q$7:$V$150,2,FALSE)),\"\",VLOOKUP($B18&$AC$4&X$15,【進行】結果入力表!$Q$7:$V$150,2,FALSE))","v":160},null,0,1,0,3,414,null,413.99999999999994,null,{"$f":"IF(ISERROR(VLOOKUP($B18&$AC$4&AH$15,【進行】結果入力表!$Q$7:$V$150,2,FALSE)),\"\",VLOOKUP($B18&$AC$4&AH$15,【進行】結果入力表!$Q$7:$V$150,2,FALSE))","v":76},null,0,1,0,4,490,null,490,null,{"$f":"IF(ISERROR(VLOOKUP($B18&$AW$4&AR$15,【進行】結果入力表!$Q$7:$V$150,2,FALSE)),\"\",VLOOKUP($B18&$AW$4&AR$15,【進行】結果入力表!$Q$7:$V$150,2,FALSE))","v":"W"},null,1,0,1,4,670,null,670,null,{"$f":"IF(ISERROR(VLOOKUP($B18&$AW$4&BB$15,【進行】結果入力表!$Q$7:$V$150,2,FALSE)),\"\",VLOOKUP($B18&$AW$4&BB$15,【進行】結果入力表!$Q$7:$V$150,2,FALSE))","v":49},null,0,1,1,5,719,null,719,null,6,{"$f":"IF(ISERROR(VLOOKUP($B18&$I$4&F$15,【進行】結果入力表!$Q$7:$V$150,3,FALSE)),\"\",VLOOKUP($B18&$I$4&F$15,【進行】結果入力表!$Q$7:$V$150,3,FALSE))","v":""},{"$f":"IF(ISERROR(VLOOKUP($B18&$I$4&N$15,【進行】結果入力表!$Q$7:$V$150,3,FALSE)),\"\",VLOOKUP($B18&$I$4&N$15,【進行】結果入力表!$Q$7:$V$150,3,FALSE))","v":""},{"$f":"IF(ISERROR(VLOOKUP($B18&$AC$4&X$15,【進行】結果入力表!$Q$7:$V$150,3,FALSE)),\"\",VLOOKUP($B18&$AC$4&X$15,【進行】結果入力表!$Q$7:$V$150,3,FALSE))","v":""},{"$f":"IF(ISERROR(VLOOKUP($B18&$AC$4&AH$15,【進行】結果入力表!$Q$7:$V$150,3,FALSE)),\"\",VLOOKUP($B18&$AC$4&AH$15,【進行】結果入力表!$Q$7:$V$150,3,FALSE))","v":""},{"$f":"IF(ISERROR(VLOOKUP($B18&$AW$4&AR$15,【進行】結果入力表!$Q$7:$V$150,3,FALSE)),\"\",VLOOKUP($B18&$AW$4&AR$15,【進行】結果入力表!$Q$7:$V$150,3,FALSE))","v":""},{"$f":"IF(ISERROR(VLOOKUP($B18&$AW$4&BB$15,【進行】結果入力表!$Q$7:$V$150,3,FALSE)),\"\",VLOOKUP($B18&$AW$4&BB$15,【進行】結果入力表!$Q$7:$V$150,3,FALSE))","v":""},null,0,0,0,0,7,"平井　洸志","HRC",0,null,{"$f":"COUNTIF(F18:BC18,\"w\")","v":1},{"$f":"COUNT(F18,N18,AH18,X18,AR18,BB18)","v":5},{"$f":"CC18*180+SUM(F18,N18,AH18,X18,AR18,BB18)*180/E18","v":719},{"$f":"CC18*100000+CE18","v":100719},null,null,null,null,null,null,null,null,null,null,null,null,0]
[null,{"$f":"IF(【準備】登録!AK16=0,\"\",【準備】登録!AK16)","v":"中尾　亮太"},null,null,{"$f":"【準備】登録!O12","v":180},{"$f":"IF(ISERROR(VLOOKUP($B19&$I$4&F$15,【進行】結果入力表!$Q$7:$V$150,2,FALSE)),\"\",VLOOKUP($B19&$I$4&F$15,【進行】結果入力表!$Q$7:$V$150,2,FALSE))","v":167},null,0,1,167,null,167,null,{"$f":"IF(ISERROR(VLOOKUP($B19&$I$4&N$15,【進行】結果入力表!$Q$7:$V$150,2,FALSE)),\"\",VLOOKUP($B19&$I$4&N$15,【進行】結果入力表!$Q$7:$V$150,2,FALSE))","v":"W"},null,1,0,1,1,347,null,347,null,{"$f":"IF(ISERROR(VLOOKUP($B19&$AC$4&X$15,【進行】結果入力表!$Q$7:$V$150,2,FALSE)),\"\",VLOOKUP($B19&$AC$4&X$15,【進行】結果入力表!$Q$7:$V$150,2,FALSE))","v":154},null,0,1,1,2,501,null,501,null,{"$f":"IF(ISERROR(VLOOKUP($B19&$AC$4&AH$15,【進行】結果入力表!$Q$7:$V$150,2,FALSE)),\"\",VLOOKUP($B19&$AC$4&AH$15,【進行】結果入力表!$Q$7:$V$150,2,FALSE))","v":"W"},null,1,0,2,2,681,null,681,null,{"$f":"IF(ISERROR(VLOOKUP($B19&$AW$4&AR$15,【進行】結果入力表!$Q$7:$V$150,2,FALSE)),\"\",VLOOKUP($B19&$AW$4&AR$15,【進行】結果入力表!$Q$7:$V$150,2,FALSE))","v":88},null,0,1,2,3,769,null,769,null,{"$f":"IF(ISERROR(VLOOKUP($B19&$AW$4&BB$15,【進行】結果入力表!$Q$7:$V$150,2,FALSE)),\"\",VLOOKUP($B19&$AW$4&BB$15,【進行】結果入力表!$Q$7:$V$150,2,FALSE))","v":"W"},null,1,0,3,3,949,null,949,null,4,{"$f":"IF(ISERROR(VLOOKUP($B19&$I$4&F$15,【進行】結果入力表!$Q$7:$V$150,3,FALSE)),\"\",VLOOKUP($B19&$I$4&F$15,【進行】結果入力表!$Q$7:$V$150,3,FALSE))","v":127},{"$f":"IF(ISERROR(VLOOKUP($B19&$I$4&N$15,【進行】結果入力表!$Q$7:$V$150,3,FALSE)),\"\",VLOOKUP($B19&$I$4&N$15,【進行】結果入力表!$Q$7:$V$150,3,FALSE))","v":""},{"$f":"IF(ISERROR(VLOOKUP($B19&$AC$4&X$15,【進行】結果入力表!$Q$7:$V$150,3,FALSE)),\"\",VLOOKUP($B19&$AC$4&X$15,【進行】結果入力表!$Q$7:$V$150,3,FALSE))","v":""},{"$f":"IF(ISERROR(VLOOKUP($B19&$AC$4&AH$15,【進行】結果入力表!$Q$7:$V$150,3,FALSE)),\"\",VLOOKUP($B19&$AC$4&AH$15,【進行】結果入力表!$Q$7:$V$150,3,FALSE))","v":""},{"$f":"IF(ISERROR(VLOOKUP($B19&$AW$4&AR$15,【進行】結果入力表!$Q$7:$V$150,3,FALSE)),\"\",VLOOKUP($B19&$AW$4&AR$15,【進行】結果入力表!$Q$7:$V$150,3,FALSE))","v":""},{"$f":"IF(ISERROR(VLOOKUP($B19&$AW$4&BB$15,【進行】結果入力表!$Q$7:$V$150,3,FALSE)),\"\",VLOOKUP($B19&$AW$4&BB$15,【進行】結果入力表!$Q$7:$V$150,3,FALSE))","v":""},null,0,0,127,127,1,"中尾　亮太","HRC",127,null,{"$f":"COUNTIF(F19:BC19,\"w\")","v":3},{"$f":"COUNT(F19,N19,AH19,X19,AR19,BB19)","v":3},{"$f":"CC19*180+SUM(F19,N19,AH19,X19,AR19,BB19)*180/E19","v":949},{"$f":"CC19*100000+CE19","v":300949},null,null,null,null,null,null,null,null,null,null,null,null,0]
[null,{"$f":"IF(【準備】登録!AK17=0,\"\",【準備】登録!AK17)","v":"宮本　一"},null,null,{"$f":"【準備】登録!R12","v":180},{"$f":"IF(ISERROR(VLOOKUP($B20&$I$4&F$15,【進行】結果入力表!$Q$7:$V$150,2,FALSE)),\"\",VLOOKUP($B20&$I$4&F$15,【進行】結果入力表!$Q$7:$V$150,2,FALSE))","v":"W"},null,1,0,180,null,180,null,{"$f":"IF(ISERROR(VLOOKUP($B20&$I$4&N$15,【進行】結果入力表!$Q$7:$V$150,2,FALSE)),\"\",VLOOKUP($B20&$I$4&N$15,【進行】結果入力表!$Q$7:$V$150,2,FALSE))","v":"W"},null,1,0,2,0,360,null,360,null,{"$f":"IF(ISERROR(VLOOKUP($B20&$AC$4&X$15,【進行】結果入力表!$Q$7:$V$150,2,FALSE)),\"\",VLOOKUP($B20&$AC$4&X$15,【進行】結果入力表!$Q$7:$V$150,2,FALSE))","v":"W"},null,1,0,3,0,540,null,540,null,{"$f":"IF(ISERROR(VLOOKUP($B20&$AC$4&AH$15,【進行】結果入力表!$Q$7:$V$150,2,FALSE)),\"\",VLOOKUP($B20&$AC$4&AH$15,【進行】結果入力表!$Q$7:$V$150,2,FALSE))","v":"W"},null,1,0,4,0,720,null,720,null,{"$f":"IF(ISERROR(VLOOKUP($B20&$AW$4&AR$15,【進行】結果入力表!$Q$7:$V$150,2,FALSE)),\"\",VLOOKUP($B20&$AW$4&AR$15,【進行】結果入力表!$Q$7:$V$150,2,FALSE))","v":130},null,0,1,4,1,850,null,850,null,{"$f":"IF(ISERROR(VLOOKUP($B20&$AW$4&BB$15,【進行】結果入力表!$Q$7:$V$150,2,FALSE)),\"\",VLOOKUP($B20&$AW$4&BB$15,【進行】結果入力表!$Q$7:$V$150,2,FALSE))","v":"W"},null,1,0,5,1,1030,null,1030,null,2,{"$f":"IF(ISERROR(VLOOKUP($B20&$I$4&F$15,【進行】結果入力表!$Q$7:$V$150,3,FALSE)),\"\",VLOOKUP($B20&$I$4&F$15,【進行】結果入力表!$Q$7:$V$150,3,FALSE))","v":""},{"$f":"IF(ISERROR(VLOOKUP($B20&$I$4&N$15,【進行】結果入力表!$Q$7:$V$150,3,FALSE)),\"\",VLOOKUP($B20&$I$4&N$15,【進行】結果入力表!$Q$7:$V$150,3,FALSE))","v":""},{"$f":"IF(ISERROR(VLOOKUP($B20&$AC$4&X$15,【進行】結果入力表!$Q$7:$V$150,3,FALSE)),\"\",VLOOKUP($B20&$AC$4&X$15,【進行】結果入力表!$Q$7:$V$150,3,FALSE))","v":""},{"$f":"IF(ISERROR(VLOOKUP($B20&$AC$4&AH$15,【進行】結果入力表!$Q$7:$V$150,3,FALSE)),\"\",VLOOKUP($B20&$AC$4&AH$15,【進行】結果入力表!$Q$7:$V$150,3,FALSE))","v":""},{"$f":"IF(ISERROR(VLOOKUP($B20&$AW$4&AR$15,【進行】結果入力表!$Q$7:$V$150,3,FALSE)),\"\",VLOOKUP($B20&$AW$4&AR$15,【進行】結果入力表!$Q$7:$V$150,3,FALSE))","v":""},{"$f":"IF(ISERROR(VLOOKUP($B20&$AW$4&BB$15,【進行】結果入力表!$Q$7:$V$150,3,FALSE)),\"\",VLOOKUP($B20&$AW$4&BB$15,【進行】結果入力表!$Q$7:$V$150,3,FALSE))","v":""},null,0,0,0,0,7,"宮本　一","HRC",0,null,{"$f":"COUNTIF(F20:BC20,\"w\")","v":5},{"$f":"COUNT(F20,N20,AH20,X20,AR20,BB20)","v":1},{"$f":"CC20*180+SUM(F20,N20,AH20,X20,AR20,BB20)*180/E20","v":1030},{"$f":"CC20*100000+CE20","v":501030},null,null,null,null,null,null,null,null,null,null,null,null,0]
[null,{"$f":"IF(【準備】登録!AK18=0,\"\",【準備】登録!AK18)","v":"河地　恵里"},null,null,{"$f":"IF(【準備】登録!U12=\"\",\"\",【準備】登録!U12)","v":140},{"$f":"IF(ISERROR(VLOOKUP($B21&$I$4&F$15,【進行】結果入力表!$Q$7:$V$150,2,FALSE)),\"\",VLOOKUP($B21&$I$4&F$15,【進行】結果入力表!$Q$7:$V$150,2,FALSE))","v":113},null,0,1,113,null,145.28571428571428,null,{"$f":"IF(ISERROR(VLOOKUP($B21&$I$4&N$15,【進行】結果入力表!$Q$7:$V$150,2,FALSE)),\"\",VLOOKUP($B21&$I$4&N$15,【進行】結果入力表!$Q$7:$V$150,2,FALSE))","v":"W"},null,1,0,1,1,253,null,325.28571428571428,null,{"$f":"IF(ISERROR(VLOOKUP($B21&$AC$4&X$15,【進行】結果入力表!$Q$7:$V$150,2,FALSE)),\"\",VLOOKUP($B21&$AC$4&X$15,【進行】結果入力表!$Q$7:$V$150,2,FALSE))","v":"W"},null,1,0,2,1,393,null,505.28571428571422,null,{"$f":"IF(ISERROR(VLOOKUP($B21&$AC$4&AH$15,【進行】結果入力表!$Q$7:$V$150,2,FALSE)),\"\",VLOOKUP($B21&$AC$4&AH$15,【進行】結果入力表!$Q$7:$V$150,2,FALSE))","v":"W"},null,1,0,3,1,533,null,685.28571428571422,null,{"$f":"IF(ISERROR(VLOOKUP($B21&$AW$4&AR$15,【進行】結果入力表!$Q$7:$V$150,2,FALSE)),\"\",VLOOKUP($B21&$AW$4&AR$15,【進行】結果入力表!$Q$7:$V$150,2,FALSE))","v":79},null,0,1,3,2,612,null,786.85714285714278,null,{"$f":"IF(ISERROR(VLOOKUP($B21&$AW$4&BB$15,【進行】結果入力表!$Q$7:$V$150,2,FALSE)),\"\",VLOOKUP($B21&$AW$4&BB$15,【進行】結果入力表!$Q$7:$V$150,2,FALSE))","v":"W"},null,1,0,4,2,752,null,966.85714285714278,null,3,{"$f":"IF(ISERROR(VLOOKUP($B21&$I$4&F$15,【進行】結果入力表!$Q$7:$V$150,3,FALSE)),\"\",VLOOKUP($B21&$I$4&F$15,【進行】結果入力表!$Q$7:$V$150,3,FALSE))","v":""},{"$f":"IF(ISERROR(VLOOKUP($B21&$I$4&N$15,【進行】結果入力表!$Q$7:$V$150,3,FALSE)),\"\",VLOOKUP($B21&$I$4&N$15,【進行】結果入力表!$Q$7:$V$150,3,FALSE))","v":""},{"$f":"IF(ISERROR(VLOOKUP($B21&$AC$4&X$15,【進行】結果入力表!$Q$7:$V$150,3,FALSE)),\"\",VLOOKUP($B21&$AC$4&X$15,【進行】結果入力表!$Q$7:$V$150,3,FALSE))","v":""},{"$f":"IF(ISERROR(VLOOKUP($B21&$AC$4&AH$15,【進行】結果入力表!$Q$7:$V$150,3,FALSE)),\"\",VLOOKUP($B21&$AC$4&AH$15,【進行】結果入力表!$Q$7:$V$150,3,FALSE))","v":""},{"$f":"IF(ISERROR(VLOOKUP($B21&$AW$4&AR$15,【進行】結果入力表!$Q$7:$V$150,3,FALSE)),\"\",VLOOKUP($B21&$AW$4&AR$15,【進行】結果入力表!$Q$7:$V$150,3,FALSE))","v":""},{"$f":"IF(ISERROR(VLOOKUP($B21&$AW$4&BB$15,【進行】結果入力表!$Q$7:$V$150,3,FALSE)),\"\",VLOOKUP($B21&$AW$4&BB$15,【進行】結果入力表!$Q$7:$V$150,3,FALSE))","v":""},null,0,0,0,0,7,"河地　恵里","HRC",0,null,{"$f":"IF(B21=\"\",\"\",COUNTIF(F21:BC21,\"w\"))","v":4},{"$f":"IF(B21=\"\",\"\",COUNT(F21,N21,AH21,X21,AR21,BB21))","v":2},{"$f":"IF(CC21=\"\",\"\",CC21*180+SUM(F21,N21,AH21,X21,AR21,BB21)*180/E21)","v":966.85714285714289},{"$f":"IF(B21=\"\",\"\",CC21*100000+CE21)","v":400966.85714285716},null,null,null,null,null,null,null,null,null,null,null,null,{"$f":"SUM(CM21:CR21)","v":0}]
[null,{"$f":"IF(【準備】登録!AK19=0,\"\",【準備】登録!AK19)","v":""},null,null,{"$f":"IF(【準備】登録!X12=\"\",\"\",【準備】登録!X12)","v":""},{"$f":"IF(ISERROR(VLOOKUP($B22&$I$4&F$15,【進行】結果入力表!$Q$7:$V$150,2,FALSE)),\"\",VLOOKUP($B22&$I$4&F$15,【進行】結果入力表!$Q$7:$V$150,2,FALSE))","v":""},null,"","","",null,"",null,{"$f":"IF(ISERROR(VLOOKUP($B22&$I$4&N$15,【進行】結果入力表!$Q$7:$V$150,2,FALSE)),\"\",VLOOKUP($B22&$I$4&N$15,【進行】結果入力表!$Q$7:$V$150,2,FALSE))","v":""},null,"","","","","",null,"",null,{"$f":"IF(ISERROR(VLOOKUP($B22&$I$4&X$15,【進行】結果入力表!$Q$7:$V$150,2,FALSE)),\"\",VLOOKUP($B22&$I$4&X$15,【進行】結果入力表!$Q$7:$V$150,2,FALSE))","v":""},null,"","","","","",null,"",null,{"$f":"IF(ISERROR(VLOOKUP($B22&$I$4&AH$15,【進行】結果入力表!$Q$7:$V$150,2,FALSE)),\"\",VLOOKUP($B22&$I$4&AH$15,【進行】結果入力表!$Q$7:$V$150,2,FALSE))","v":""},null,"","","","","",null,"",null,{"$f":"IF(ISERROR(VLOOKUP($B22&$AW$4&AR$15,【進行】結果入力表!$Q$7:$V$150,2,FALSE)),\"\",VLOOKUP($B22&$AW$4&AR$15,【進行】結果入力表!$Q$7:$V$150,2,FALSE))","v":""},null,"","","","","",null,"",null,{"$f":"IF(ISERROR(VLOOKUP($B22&$AW$4&BB$15,【進行】結果入力表!$Q$7:$V$150,2,FALSE)),\"\",VLOOKUP($B22&$AW$4&BB$15,【進行】結果入力表!$Q$7:$V$150,2,FALSE))","v":""},null,"","","","","",null,"",null,"",{"$f":"IF(ISERROR(VLOOKUP($B22&$I$4&F$15,【進行】結果入力表!$Q$7:$V$150,3,FALSE)),\"\",VLOOKUP($B22&$I$4&F$15,【進行】結果入力表!$Q$7:$V$150,3,FALSE))","v":""},{"$f":"IF(ISERROR(VLOOKUP($B22&$I$4&N$15,【進行】結果入力表!$Q$7:$V$150,3,FALSE)),\"\",VLOOKUP($B22&$I$4&N$15,【進行】結果入力表!$Q$7:$V$150,3,FALSE))","v":""},{"$f":"IF(ISERROR(VLOOKUP($B22&$AC$4&X$15,【進行】結果入力表!$Q$7:$V$150,3,FALSE)),\"\",VLOOKUP($B22&$AC$4&X$15,【進行】結果入力表!$Q$7:$V$150,3,FALSE))","v":""},{"$f":"IF(ISERROR(VLOOKUP($B22&$AC$4&AH$15,【進行】結果入力表!$Q$7:$V$150,3,FALSE)),\"\",VLOOKUP($B22&$AC$4&AH$15,【進行】結果入力表!$Q$7:$V$150,3,FALSE))","v":""},{"$f":"IF(ISERROR(VLOOKUP($B22&$AW$4&AR$15,【進行】結果入力表!$Q$7:$V$150,3,FALSE)),\"\",VLOOKUP($B22&$AW$4&AR$15,【進行】結果入力表!$Q$7:$V$150,3,FALSE))","v":""},{"$f":"IF(ISERROR(VLOOKUP($B22&$AW$4&BB$15,【進行】結果入力表!$Q$7:$V$150,3,FALSE)),\"\",VLOOKUP($B22&$AW$4&BB$15,【進行】結果入力表!$Q$7:$V$150,3,FALSE))","v":""},null,0,0,0,0,7,"","HRC",0,null,{"$f":"IF(B22=\"\",\"\",COUNTIF(F22:BC22,\"w\"))","v":""},{"$f":"IF(B22=\"\",\"\",COUNT(F22,N22,AH22,X22,AR22,BB22))","v":""},{"$f":"IF(CC22=\"\",\"\",CC22*180+SUM(F22,N22,AH22,X22,AR22,BB22)*180/E22)","v":""},{"$f":"IF(B22=\"\",\"\",CC22*100000+CE22)","v":""},null,null,null,null,null,null,null,null,null,null,null,null,0]
[null,{"$f":"IF(【準備】登録!AK20=0,\"\",【準備】登録!AK20)","v":""},null,null,{"$f":"IF(【準備】登録!$Y$12=\"\",\"\",【準備】登録!AA12)","v":""},{"$f":"IF(ISERROR(VLOOKUP($B23&$I$4&F$15,【進行】結果入力表!$Q$7:$V$150,2,FALSE)),\"\",VLOOKUP($B23&$I$4&F$15,【進行】結果入力表!$Q$7:$V$150,2,FALSE))","v":""},null,"","","",null,"",null,{"$f":"IF(ISERROR(VLOOKUP($B23&$I$4&N$15,【進行】結果入力表!$Q$7:$V$150,2,FALSE)),\"\",VLOOKUP($B23&$I$4&N$15,【進行】結果入力表!$Q$7:$V$150,2,FALSE))","v":""},null,"","","","","",null,"",null,{"$f":"IF(ISERROR(VLOOKUP($B23&$I$4&X$15,【進行】結果入力表!$Q$7:$V$150,2,FALSE)),\"\",VLOOKUP($B23&$I$4&X$15,【進行】結果入力表!$Q$7:$V$150,2,FALSE))","v":""},null,"","","","","",null,"",null,{"$f":"IF(ISERROR(VLOOKUP($B23&$I$4&AH$15,【進行】結果入力表!$Q$7:$V$150,2,FALSE)),\"\",VLOOKUP($B23&$I$4&AH$15,【進行】結果入力表!$Q$7:$V$150,2,FALSE))","v":""},null,"","","","","",null,"",null,{"$f":"IF(ISERROR(VLOOKUP($B23&$AW$4&AR$15,【進行】結果入力表!$Q$7:$V$150,2,FALSE)),\"\",VLOOKUP($B23&$AW$4&AR$15,【進行】結果入力表!$Q$7:$V$150,2,FALSE))","v":""},null,"","","","","",null,"",null,{"$f":"IF(ISERROR(VLOOKUP($B23&$AW$4&BB$15,【進行】結果入力表!$Q$7:$V$150,2,FALSE)),\"\",VLOOKUP($B23&$AW$4&BB$15,【進行】結果入力表!$Q$7:$V$150,2,FALSE))","v":""},null,"","","","","",null,"",null,"",{"$f":"IF(ISERROR(VLOOKUP($B23&$I$4&F$15,【進行】結果入力表!$Q$7:$V$150,3,FALSE)),\"\",VLOOKUP($B23&$I$4&F$15,【進行】結果入力表!$Q$7:$V$150,3,FALSE))","v":""},{"$f":"IF(ISERROR(VLOOKUP($B23&$I$4&N$15,【進行】結果入力表!$Q$7:$V$150,3,FALSE)),\"\",VLOOKUP($B23&$I$4&N$15,【進行】結果入力表!$Q$7:$V$150,3,FALSE))","v":""},{"$f":"IF(ISERROR(VLOOKUP($B23&$AC$4&X$15,【進行】結果入力表!$Q$7:$V$150,3,FALSE)),\"\",VLOOKUP($B23&$AC$4&X$15,【進行】結果入力表!$Q$7:$V$150,3,FALSE))","v":""},{"$f":"IF(ISERROR(VLOOKUP($B23&$AC$4&AH$15,【進行】結果入力表!$Q$7:$V$150,3,FALSE)),\"\",VLOOKUP($B23&$AC$4&AH$15,【進行】結果入力表!$Q$7:$V$150,3,FALSE))","v":""},{"$f":"IF(ISERROR(VLOOKUP($B23&$AW$4&AR$15,【進行】結果入力表!$Q$7:$V$150,3,FALSE)),\"\",VLOOKUP($B23&$AW$4&AR$15,【進行】結果入力表!$Q$7:$V$150,3,FALSE))","v":""},{"$f":"IF(ISERROR(VLOOKUP($B23&$AW$4&BB$15,【進行】結果入力表!$Q$7:$V$150,3,FALSE)),\"\",VLOOKUP($B23&$AW$4&BB$15,【進行】結果入力表!$Q$7:$V$150,3,FALSE))","v":""},null,0,0,0,0,7,"","HRC",0,null,{"$f":"IF(B23=\"\",\"\",COUNTIF(F23:BC23,\"w\"))","v":""},{"$f":"IF(B23=\"\",\"\",COUNT(F23,N23,AH23,X23,AR23,BB23))","v":""},{"$f":"IF(CC23=\"\",\"\",CC23*180+SUM(F23,N23,AH23,X23,AR23,BB23)*180/E23)","v":""},{"$f":"IF(B23=\"\",\"\",CC23*100000+CE23)","v":""},null,null,null,null,null,null,null,null,null,null,null,null,{"$f":"SUM(CM23:CR23)","v":0}]
[null,"Total",null,null,null,null,null,{"$f":"IF(COUNTBLANK(H16:H23)=8,\"\",SUM(H16:H23))","v":2},{"$f":"IF(COUNTBLANK(I16:I23)=8,\"\",SUM(I16:I23))","v":4},{"$f":"IF($B16=\"\",\"\",SUM(J16:J23))","v":931},{"$f":"IF($B16=\"\",\"\",SUM(K16:K23))","v":0},{"$f":"IF(COUNTBLANK(L16:L23)=8,\"\",SUM(L16:L23))","v":963.28571428571422},{"$f":"IF($B16=\"\",\"\",SUM(M16:M23))","v":0},null,null,{"$f":"SUM(P16:P23)","v":5},{"$f":"SUM(Q16:Q23)","v":1},{"$f":"IF(COUNTBLANK(R16:R23)=8,\"\",SUM(H24,P24))","v":7},{"$f":"IF(COUNTBLANK(S16:S23)=8,\"\",SUM(I24,Q24))","v":5},{"$f":"IF($B16=\"\",\"\",SUM(T16:T23))","v":1884},{"$f":"IF($B16=\"\",\"\",SUM(U16:U23))","v":0},{"$f":"IF(COUNTBLANK(V16:V23)=8,\"\",SUM(V16:V23))","v":1956.2857142857142},{"$f":"IF($B16=\"\",\"\",SUM(W16:W23))","v":0},null,null,{"$f":"SUM(Z16:Z23)","v":2},{"$f":"SUM(AA16:AA23)","v":4},{"$f":"IF(COUNTBLANK(AB16:AB23)=8,\"\",SUM(R24,Z24))","v":9},{"$f":"IF(COUNTBLANK(AC16:AC23)=8,\"\",SUM(S24,AA24))","v":9},{"$f":"IF($B16=\"\",\"\",SUM(AD16:AD23))","v":2813},{"$f":"IF($B16=\"\",\"\",SUM(AE16:AE23))","v":0},{"$f":"IF(COUNTBLANK(AF16:AF23)=8,\"\",SUM(AF16:AF23))","v":2925.2857142857142},{"$f":"IF($B16=\"\",\"\",SUM(AG16:AG23))","v":0},null,null,{"$f":"SUM(AJ16:AJ23)","v":5},{"$f":"SUM(AK16:AK23)","v":1},{"$f":"IF(COUNTBLANK(AL16:AL23)=8,\"\",SUM(AB24,AJ24))","v":14},{"$f":"IF(COUNTBLANK(AM16:AM23)=8,\"\",SUM(AC24,AK24))","v":10},{"$f":"IF($B16=\"\",\"\",SUM(AN16:AN23))","v":3749},{"$f":"IF($B16=\"\",\"\",SUM(AO16:AO23))","v":0},{"$f":"IF(COUNTBLANK(AP16:AP23)=8,\"\",SUM(AP16:AP23))","v":3901.2857142857142},{"$f":"IF($B16=\"\",\"\",SUM(AQ16:AQ23))","v":0},null,null,{"$f":"SUM(AT16:AT23)","v":2},{"$f":"SUM(AU16:AU23)","v":4},{"$f":"IF(COUNTBLANK(AV16:AV23)=8,\"\",SUM(AL24,AT24))","v":16},{"$f":"IF(COUNTBLANK(AW16:AW23)=8,\"\",SUM(AM24,AU24))","v":14},{"$f":"IF($B16=\"\",\"\",SUM(AX16:AX23))","v":4453},{"$f":"IF($B16=\"\",\"\",SUM(AY16:AY23))","v":0},{"$f":"IF(COUNTBLANK(AZ16:AZ23)=8,\"\",SUM(AZ16:AZ23))","v":4627.8571428571431},{"$f":"IF($B16=\"\",\"\",SUM(BA16:BA23))","v":0},null,null,{"$f":"SUM(BD16:BD23)","v":5},{"$f":"SUM(BE16:BE23)","v":1},{"$f":"IF(COUNTBLANK(BF16:BF23)=8,\"\",SUM(AV24,BD24))","v":21},{"$f":"IF(COUNTBLANK(BG16:BG23)=8,\"\",SUM(AW24,BE24))","v":15},{"$f":"IF(COUNTIF(BH16:BI23,\"\")=16,\"\",SUM(BH16:BH23))","v":5362},{"$f":"IF($B16=\"\",\"\",SUM(BI16:BI23))","v":0},{"$f":"IF(COUNTBLANK(BJ16:BJ23)=8,\"\",SUM(BJ16:BJ23))","v":5576.8571428571431},{"$f":"IF($B16=\"\",\"\",SUM(BK16:BK23))","v":0},null,null,null,null,null,null,null,null,null,null,null,null,null,null,"HRC",null,null,{"$f":"SUM(CC16:CC23)","v":21},{"$f":"SUM(CD16:CD23)","v":15},{"$f":"SUM(CE16:CE23)","v":5576.8571428571431},{"$f":"SUM(CF16:CF23)","v":2105576.8571428573}]
[{"$f":"IF(【準備】登録!B13=\"\",\"\",【準備】登録!B13)","v":"NRC"},{"$f":"B5","v":"選手名"},null,null,{"$f":"E5","v":"持点"},{"$f":"A5","v":"SBC"},null,"W","L","TP",null,"TP",null,{"$f":"A15","v":"HRC"},null,"W","L","W","L","TP",null,"TP",null,{"$f":"A5","v":"SBC"},null,"W","L","W","L","TP",null,"TP",null,{"$f":"A15","v":"HRC"},null,"W","L","W","L","TP",null,"TP",null,{"$f":"A5","v":"SBC"},null,"W","L","W","L","TP",null,"TP",null,{"$f":"A15","v":"HRC"},null,"W","L","W","L","TP",null,"TP",null,"R",{"$f":"BM$5","v":"1G"},"2G","3G","4G","5G","6G",null,null,null,null,null,null,null,null,null,null,{"$f":"CC$5","v":"W"},{"$f":"CD$5","v":"L"},{"$f":"CE$5","v":"TP"},{"$f":"CF$5","v":"R_P"}]
[null,{"$f":"IF(【準備】登録!AK5=0,\"\",【準備】登録!AK5)","v":"岩本　剛"},null,null,{"$f":"【準備】登録!F13","v":180},{"$f":"IF(ISERROR(VLOOKUP($B26&$I$4&F$25,【進行】結果入力表!$Q$7:$V$150,2,FALSE)),\"\",VLOOKUP($B26&$I$4&F$25,【進行】結果入力表!$Q$7:$V$150,2,FALSE))","v":43},null,{"$f":"IF(F26=\"\",\"\",IF(F26=\"w\",1,0))","v":0},{"$f":"IF(F26=\"\",\"\",IF(F26=\"w\",0,1))","v":1},{"$f":"IF(F26=\"\",\"\",IF(F26=\"w\",E26,F26))","v":43},null,{"$f":"IF($F26=\"\",\"\",J26/$E26*180)","v":43},null,{"$f":"IF(ISERROR(VLOOKUP($B26&$I$4&N$25,【進行】結果入力表!$Q$7:$V$150,2,FALSE)),\"\",VLOOKUP($B26&$I$4&N$25,【進行】結果入力表!$Q$7:$V$150,2,FALSE))","v":152},null,{"$f":"IF(N26=\"\",\"\",IF(N26=\"w\",1,0))","v":0},{"$f":"IF(N26=\"\",\"\",IF(N26=\"w\",0,1))","v":1},{"$f":"IF(N26=\"\",\"\",SUM(H26,P26))","v":0},{"$f":"IF(N26=\"\",\"\",SUM(I26,Q26))","v":2},{"$f":"IF(N26=\"\",\"\",IF(N26=\"w\",E26+J26,N26+J26))","v":195},null,{"$f":"IF($N26=\"\",\"\",T26/$E26*180)","v":195},null,{"$f":"IF(ISERROR(VLOOKUP($B26&$AC$4&X$25,【進行】結果入力表!$Q$7:$V$150,2,FALSE)),\"\",VLOOKUP($B26&$AC$4&X$25,【進行】結果入力表!$Q$7:$V$150,2,FALSE))","v":45},null,{"$f":"IF(X26=\"\",\"\",IF(X26=\"w\",1,0))","v":0},{"$f":"IF(X26=\"\",\"\",IF(X26=\"w\",0,1))","v":1},{"$f":"IF(X26=\"\",\"\",SUM(R26,Z26))","v":0},{"$f":"IF(X26=\"\",\"\",SUM(S26,AA26))","v":3},{"$f":"IF(X26=\"\",\"\",IF(X26=\"w\",T26+E26,X26+T26))","v":240},null,{"$f":"IF($X26=\"\",\"\",AD26/$E26*180)","v":240},null,{"$f":"IF(ISERROR(VLOOKUP($B26&$AC$4&AH$25,【進行】結果入力表!$Q$7:$V$150,2,FALSE)),\"\",VLOOKUP($B26&$AC$4&AH$25,【進行】結果入力表!$Q$7:$V$150,2,FALSE))","v":16},null,{"$f":"IF(AH26=\"\",\"\",IF(AH26=\"w\",1,0))","v":0},{"$f":"IF(AH26=\"\",\"\",IF(AH26=\"w\",0,1))","v":1},{"$f":"IF(AH26=\"\",\"\",SUM(AB26,AJ26))","v":0},{"$f":"IF(AH26=\"\",\"\",SUM(AC26,AK26))","v":4},{"$f":"IF(AH26=\"\",\"\",IF(AH26=\"w\",AD26+E26,AH26+AD26))","v":256},null,{"$f":"IF($AH26=\"\",\"\",AN26/$E26*180)","v":256},null,{"$f":"IF(ISERROR(VLOOKUP($B26&$AW$4&AR$25,【進行】結果入力表!$Q$7:$V$150,2,FALSE)),\"\",VLOOKUP($B26&$AW$4&AR$25,【進行】結果入力表!$Q$7:$V$150,2,FALSE))","v":"W"},null,{"$f":"IF(AR26=\"\",\"\",IF(AR26=\"w\",1,0))","v":1},{"$f":"IF(AR26=\"\",\"\",IF(AR26=\"w\",0,1))","v":0},{"$f":"IF(AR26=\"\",\"\",IF(AR26=\"w\",AL26+1,AL26))","v":1},{"$f":"IF(AR26=\"\",\"\",IF(AR26=\"w\",AM26,AM26+1))","v":4},{"$f":"IF(AR26=\"\",\"\",IF(AR26=\"w\",AN26+E26,AR26+AN26))","v":436},null,{"$f":"IF($AR26=\"\",\"\",AX26/$E26*180)","v":435.99999999999994},null,{"$f":"IF(ISERROR(VLOOKUP($B26&$AW$4&BB$25,【進行】結果入力表!$Q$7:$V$150,2,FALSE)),\"\",VLOOKUP($B26&$AW$4&BB$25,【進行】結果入力表!$Q$7:$V$150,2,FALSE))","v":"W"},null,{"$f":"IF(BB26=\"\",\"\",IF(BB26=\"w\",1,0))","v":1},{"$f":"IF(BB26=\"\",\"\",IF(BB26=\"w\",0,1))","v":0},{"$f":"IF(BB26=\"\",\"\",IF(BB26=\"w\",AV26+1,AV26))","v":2},{"$f":"IF(BB26=\"\",\"\",IF(BB26=\"w\",AW26,AW26+1))","v":4},{"$f":"IF(BB26=\"\",\"\",IF(BB26=\"w\",AX26+E26,BB26+AX26))","v":616},null,{"$f":"IF($BB26=\"\",\"\",BH26/$E26*180)","v":616},null,{"$f":"IF(SUM(H26:I26,R26:S26)=0,\"\",IF(B$13=\"\",RANK($CF$26:$CF$32,$CF$26:$CF$32,0),RANK($CF$26:$CF$33,$CF$26:$CF$33,0)))","v":4},{"$f":"IF(ISERROR(VLOOKUP($B26&$I$4&F$25,【進行】結果入力表!$Q$7:$V$150,3,FALSE)),\"\",VLOOKUP($B26&$I$4&F$25,【進行】結果入力表!$Q$7:$V$150,3,FALSE))","v":""},{"$f":"IF(ISERROR(VLOOKUP($B26&$I$4&N$25,【進行】結果入力表!$Q$7:$V$150,3,FALSE)),\"\",VLOOKUP($B26&$I$4&N$25,【進行】結果入力表!$Q$7:$V$150,3,FALSE))","v":100},{"$f":"IF(ISERROR(VLOOKUP($B26&$AC$4&X$25,【進行】結果入力表!$Q$7:$V$150,3,FALSE)),\"\",VLOOKUP($B26&$AC$4&X$25,【進行】結果入力表!$Q$7:$V$150,3,FALSE))","v":""},{"$f":"IF(ISERROR(VLOOKUP($B26&$AC$4&AH$25,【進行】結果入力表!$Q$7:$V$150,3,FALSE)),\"\",VLOOKUP($B26&$AC$4&AH$25,【進行】結果入力表!$Q$7:$V$150,3,FALSE))","v":""},{"$f":"IF(ISERROR(VLOOKUP($B26&$AW$4&AR$25,【進行】結果入力表!$Q$7:$V$150,3,FALSE)),\"\",VLOOKUP($B26&$AW$4&AR$25,【進行】結果入力表!$Q$7:$V$150,3,FALSE))","v":""},{"$f":"IF(ISERROR(VLOOKUP($B26&$AW$4&BB$25,【進行】結果入力表!$Q$7:$V$150,3,FALSE)),\"\",VLOOKUP($B26&$AW$4&BB$25,【進行】結果入力表!$Q$7:$V$150,3,FALSE))","v":""},null,{"$f":"COUNTIF($BM26:$BR26,BT$5)","v":0},0,{"$f":"MAX($BM26:$BR26)","v":100},{"$f":"BT26*10000+BU26*1000+BV26","v":100},{"$f":"RANK(BW26,$BW$6:$BW$33)","v":6},{"$f":"B26","v":"岩本　剛"},{"$f":"$A$25","v":"NRC"},{"$f":"IF(BT26>0,\"A\"&E26,IF(BU26>0,\"B\"&E26,BV26))","v":100},null,{"$f":"COUNTIF(F26:BC26,\"w\")","v":2},{"$f":"COUNT(F26,N26,AH26,X26,AR26,BB26)","v":4},{"$f":"CC26*180+SUM(F26,N26,AH26,X26,AR26,BB26)*180/E26","v":616},{"$f":"CC26*100000+CE26","v":200616},null,null,null,null,null,null,null,null,null,null,null,null,{"$f":"SUM(CM26:CR26)","v":0}]
[null,{"$f":"IF(【準備】登録!AK6=0,\"\",【準備】登録!AK6)","v":"吉向　翔平"},null,null,{"$f":"【準備】登録!I13","v":180},{"$f":"IF(ISERROR(VLOOKUP($B27&$I$4&F$25,【進行】結果入力表!$Q$7:$V$150,2,FALSE)),\"\",VLOOKUP($B27&$I$4&F$25,【進行】結果入力表!$Q$7:$V$150,2,FALSE))","v":"W"},null,1,0,180,null,180,null,{"$f":"IF(ISERROR(VLOOKUP($B27&$I$4&N$25,【進行】結果入力表!$Q$7:$V$150,2,FALSE)),\"\",VLOOKUP($B27&$I$4&N$25,【進行】結果入力表!$Q$7:$V$150,2,FALSE))","v":96},null,0,1,1,1,276,null,276,null,{"$f":"IF(ISERROR(VLOOKUP($B27&$AC$4&X$25,【進行】結果入力表!$Q$7:$V$150,2,FALSE)),\"\",VLOOKUP($B27&$AC$4&X$25,【進行】結果入力表!$Q$7:$V$150,2,FALSE))","v":130},null,0,1,1,2,406,null,406,null,{"$f":"IF(ISERROR(VLOOKUP($B27&$AC$4&AH$25,【進行】結果入力表!$Q$7:$V$150,2,FALSE)),\"\",VLOOKUP($B27&$AC$4&AH$25,【進行】結果入力表!$Q$7:$V$150,2,FALSE))","v":"W"},null,1,0,2,2,586,null,586,null,{"$f":"IF(ISERROR(VLOOKUP($B27&$AW$4&AR$25,【進行】結果入力表!$Q$7:$V$150,2,FALSE)),\"\",VLOOKUP($B27&$AW$4&AR$25,【進行】結果入力表!$Q$7:$V$150,2,FALSE))","v":"W"},null,1,0,3,2,766,null,766,null,{"$f":"IF(ISERROR(VLOOKUP($B27&$AW$4&BB$25,【進行】結果入力表!$Q$7:$V$150,2,FALSE)),\"\",VLOOKUP($B27&$AW$4&BB$25,【進行】結果入力表!$Q$7:$V$150,2,FALSE))","v":88},null,0,1,3,3,854,null,854,null,2,{"$f":"IF(ISERROR(VLOOKUP($B27&$I$4&F$25,【進行】結果入力表!$Q$7:$V$150,3,FALSE)),\"\",VLOOKUP($B27&$I$4&F$25,【進行】結果入力表!$Q$7:$V$150,3,FALSE))","v":""},{"$f":"IF(ISERROR(VLOOKUP($B27&$I$4&N$25,【進行】結果入力表!$Q$7:$V$150,3,FALSE)),\"\",VLOOKUP($B27&$I$4&N$25,【進行】結果入力表!$Q$7:$V$150,3,FALSE))","v":""},{"$f":"IF(ISERROR(VLOOKUP($B27&$AC$4&X$25,【進行】結果入力表!$Q$7:$V$150,3,FALSE)),\"\",VLOOKUP($B27&$AC$4&X$25,【進行】結果入力表!$Q$7:$V$150,3,FALSE))","v":""},{"$f":"IF(ISERROR(VLOOKUP($B27&$AC$4&AH$25,【進行】結果入力表!$Q$7:$V$150,3,FALSE)),\"\",VLOOKUP($B27&$AC$4&AH$25,【進行】結果入力表!$Q$7:$V$150,3,FALSE))","v":""},{"$f":"IF(ISERROR(VLOOKUP($B27&$AW$4&AR$25,【進行】結果入力表!$Q$7:$V$150,3,FALSE)),\"\",VLOOKUP($B27&$AW$4&AR$25,【進行】結果入力表!$Q$7:$V$150,3,FALSE))","v":""},{"$f":"IF(ISERROR(VLOOKUP($B27&$AW$4&BB$25,【進行】結果入力表!$Q$7:$V$150,3,FALSE)),\"\",VLOOKUP($B27&$AW$4&BB$25,【進行】結果入力表!$Q$7:$V$150,3,FALSE))","v":""},null,0,0,0,0,7,"吉向　翔平","NRC",0,null,{"$f":"COUNTIF(F27:BC27,\"w\")","v":3},{"$f":"COUNT(F27,N27,AH27,X27,AR27,BB27)","v":3},{"$f":"CC27*180+SUM(F27,N27,AH27,X27,AR27,BB27)*180/E27","v":854},{"$f":"CC27*100000+CE27","v":300854},null,null,null,null,null,null,null,null,null,null,null,null,{"$f":"SUM(CM27:CR27)","v":0}]
[null,{"$f":"IF(【準備】登録!AK7=0,\"\",【準備】登録!AK7)","v":"金澤　茂昌"},null,null,{"$f":"【準備】登録!L13","v":180},{"$f":"IF(ISERROR(VLOOKUP($B28&$I$4&F$25,【進行】結果入力表!$Q$7:$V$150,2,FALSE)),\"\",VLOOKUP($B28&$I$4&F$25,【進行】結果入力表!$Q$7:$V$150,2,FALSE))","v":"W"},null,1,0,180,null,180,null,{"$f":"IF(ISERROR(VLOOKUP($B28&$I$4&N$25,【進行】結果入力表!$Q$7:$V$150,2,FALSE)),\"\",VLOOKUP($B28&$I$4&N$25,【進行】結果入力表!$Q$7:$V$150,2,FALSE))","v":"W"},null,1,0,2,0,360,null,360,null,{"$f":"IF(ISERROR(VLOOKUP($B28&$AC$4&X$25,【進行】結果入力表!$Q$7:$V$150,2,FALSE)),\"\",VLOOKUP($B28&$AC$4&X$25,【進行】結果入力表!$Q$7:$V$150,2,FALSE))","v":"W"},null,1,0,3,0,540,null,540,null,{"$f":"IF(ISERROR(VLOOKUP($B28&$AC$4&AH$25,【進行】結果入力表!$Q$7:$V$150,2,FALSE)),\"\",VLOOKUP($B28&$AC$4&AH$25,【進行】結果入力表!$Q$7:$V$150,2,FALSE))","v":102},null,0,1,3,1,642,null,642,null,{"$f":"IF(ISERROR(VLOOKUP($B28&$AW$4&AR$25,【進行】結果入力表!$Q$7:$V$150,2,FALSE)),\"\",VLOOKUP($B28&$AW$4&AR$25,【進行】結果入力表!$Q$7:$V$150,2,FALSE))","v":70},null,0,1,3,2,712,null,712,null,{"$f":"IF(ISERROR(VLOOKUP($B28&$AW$4&BB$25,【進行】結果入力表!$Q$7:$V$150,2,FALSE)),\"\",VLOOKUP($B28&$AW$4&BB$25,【進行】結果入力表!$Q$7:$V$150,2,FALSE))","v":147},null,0,1,3,3,859,null,859,null,1,{"$f":"IF(ISERROR(VLOOKUP($B28&$I$4&F$25,【進行】結果入力表!$Q$7:$V$150,3,FALSE)),\"\",VLOOKUP($B28&$I$4&F$25,【進行】結果入力表!$Q$7:$V$150,3,FALSE))","v":""},{"$f":"IF(ISERROR(VLOOKUP($B28&$I$4&N$25,【進行】結果入力表!$Q$7:$V$150,3,FALSE)),\"\",VLOOKUP($B28&$I$4&N$25,【進行】結果入力表!$Q$7:$V$150,3,FALSE))","v":""},{"$f":"IF(ISERROR(VLOOKUP($B28&$AC$4&X$25,【進行】結果入力表!$Q$7:$V$150,3,FALSE)),\"\",VLOOKUP($B28&$AC$4&X$25,【進行】結果入力表!$Q$7:$V$150,3,FALSE))","v":""},{"$f":"IF(ISERROR(VLOOKUP($B28&$AC$4&AH$25,【進行】結果入力表!$Q$7:$V$150,3,FALSE)),\"\",VLOOKUP($B28&$AC$4&AH$25,【進行】結果入力表!$Q$7:$V$150,3,FALSE))","v":""},{"$f":"IF(ISERROR(VLOOKUP($B28&$AW$4&AR$25,【進行】結果入力表!$Q$7:$V$150,3,FALSE)),\"\",VLOOKUP($B28&$AW$4&AR$25,【進行】結果入力表!$Q$7:$V$150,3,FALSE))","v":""},{"$f":"IF(ISERROR(VLOOKUP($B28&$AW$4&BB$25,【進行】結果入力表!$Q$7:$V$150,3,FALSE)),\"\",VLOOKUP($B28&$AW$4&BB$25,【進行】結果入力表!$Q$7:$V$150,3,FALSE))","v":""},null,0,0,0,0,7,"金澤　茂昌","NRC",0,null,{"$f":"COUNTIF(F28:BC28,\"w\")","v":3},{"$f":"COUNT(F28,N28,AH28,X28,AR28,BB28)","v":3},{"$f":"CC28*180+SUM(F28,N28,AH28,X28,AR28,BB28)*180/E28","v":859},{"$f":"CC28*100000+CE28","v":300859},null,null,null,null,null,null,null,null,null,null,null,null,0]
[null,{"$f":"IF(【準備】登録!AK8=0,\"\",【準備】登録!AK8)","v":"植田　慎也"},null,null,{"$f":"【準備】登録!O13","v":180},{"$f":"IF(ISERROR(VLOOKUP($B29&$I$4&F$25,【進行】結果入力表!$Q$7:$V$150,2,FALSE)),\"\",VLOOKUP($B29&$I$4&F$25,【進行】結果入力表!$Q$7:$V$150,2,FALSE))","v":39},null,0,1,39,null,39,null,{"$f":"IF(ISERROR(VLOOKUP($B29&$I$4&N$25,【進行】結果入力表!$Q$7:$V$150,2,FALSE)),\"\",VLOOKUP($B29&$I$4&N$25,【進行】結果入力表!$Q$7:$V$150,2,FALSE))","v":136},null,0,1,0,2,175,null,175,null,{"$f":"IF(ISERROR(VLOOKUP($B29&$AC$4&X$25,【進行】結果入力表!$Q$7:$V$150,2,FALSE)),\"\",VLOOKUP($B29&$AC$4&X$25,【進行】結果入力表!$Q$7:$V$150,2,FALSE))","v":"W"},null,1,0,1,2,355,null,355,null,{"$f":"IF(ISERROR(VLOOKUP($B29&$AC$4&AH$25,【進行】結果入力表!$Q$7:$V$150,2,FALSE)),\"\",VLOOKUP($B29&$AC$4&AH$25,【進行】結果入力表!$Q$7:$V$150,2,FALSE))","v":56},null,0,1,1,3,411,null,411,null,{"$f":"IF(ISERROR(VLOOKUP($B29&$AW$4&AR$25,【進行】結果入力表!$Q$7:$V$150,2,FALSE)),\"\",VLOOKUP($B29&$AW$4&AR$25,【進行】結果入力表!$Q$7:$V$150,2,FALSE))","v":"W"},null,1,0,2,3,591,null,591,null,{"$f":"IF(ISERROR(VLOOKUP($B29&$AW$4&BB$25,【進行】結果入力表!$Q$7:$V$150,2,FALSE)),\"\",VLOOKUP($B29&$AW$4&BB$25,【進行】結果入力表!$Q$7:$V$150,2,FALSE))","v":83},null,0,1,2,4,674,null,674,null,3,{"$f":"IF(ISERROR(VLOOKUP($B29&$I$4&F$25,【進行】結果入力表!$Q$7:$V$150,3,FALSE)),\"\",VLOOKUP($B29&$I$4&F$25,【進行】結果入力表!$Q$7:$V$150,3,FALSE))","v":""},{"$f":"IF(ISERROR(VLOOKUP($B29&$I$4&N$25,【進行】結果入力表!$Q$7:$V$150,3,FALSE)),\"\",VLOOKUP($B29&$I$4&N$25,【進行】結果入力表!$Q$7:$V$150,3,FALSE))","v":""},{"$f":"IF(ISERROR(VLOOKUP($B29&$AC$4&X$25,【進行】結果入力表!$Q$7:$V$150,3,FALSE)),\"\",VLOOKUP($B29&$AC$4&X$25,【進行】結果入力表!$Q$7:$V$150,3,FALSE))","v":""},{"$f":"IF(ISERROR(VLOOKUP($B29&$AC$4&AH$25,【進行】結果入力表!$Q$7:$V$150,3,FALSE)),\"\",VLOOKUP($B29&$AC$4&AH$25,【進行】結果入力表!$Q$7:$V$150,3,FALSE))","v":""},{"$f":"IF(ISERROR(VLOOKUP($B29&$AW$4&AR$25,【進行】結果入力表!$Q$7:$V$150,3,FALSE)),\"\",VLOOKUP($B29&$AW$4&AR$25,【進行】結果入力表!$Q$7:$V$150,3,FALSE))","v":102},{"$f":"IF(ISERROR(VLOOKUP($B29&$AW$4&BB$25,【進行】結果入力表!$Q$7:$V$150,3,FALSE)),\"\",VLOOKUP($B29&$AW$4&BB$25,【進行】結果入力表!$Q$7:$V$150,3,FALSE))","v":""},null,0,0,102,102,5,"植田　慎也","NRC",102,null,{"$f":"COUNTIF(F29:BC29,\"w\")","v":2},{"$f":"COUNT(F29,N29,AH29,X29,AR29,BB29)","v":4},{"$f":"CC29*180+SUM(F29,N29,AH29,X29,AR29,BB29)*180/E29","v":674},{"$f":"CC29*100000+CE29","v":200674},null,null,null,null,null,null,null,null,null,null,null,null,0]
[null,{"$f":"IF(【準備】登録!AK9=0,\"\",【準備】登録!AK9)","v":"長谷川　進"},null,null,{"$f":"【準備】登録!R13","v":180},{"$f":"IF(ISERROR(VLOOKUP($B30&$I$4&F$25,【進行】結果入力表!$Q$7:$V$150,2,FALSE)),\"\",VLOOKUP($B30&$I$4&F$25,【進行】結果入力表!$Q$7:$V$150,2,FALSE))","v":153},null,0,1,153,null,153,null,{"$f":"IF(ISERROR(VLOOKUP($B30&$I$4&N$25,【進行】結果入力表!$Q$7:$V$150,2,FALSE)),\"\",VLOOKUP($B30&$I$4&N$25,【進行】結果入力表!$Q$7:$V$150,2,FALSE))","v":40},null,0,1,0,2,193,null,193,null,{"$f":"IF(ISERROR(VLOOKUP($B30&$AC$4&X$25,【進行】結果入力表!$Q$7:$V$150,2,FALSE)),\"\",VLOOKUP($B30&$AC$4&X$25,【進行】結果入力表!$Q$7:$V$150,2,FALSE))","v":45},null,0,1,0,3,238,null,238,null,{"$f":"IF(ISERROR(VLOOKUP($B30&$AC$4&AH$25,【進行】結果入力表!$Q$7:$V$150,2,FALSE)),\"\",VLOOKUP($B30&$AC$4&AH$25,【進行】結果入力表!$Q$7:$V$150,2,FALSE))","v":110},null,0,1,0,4,348,null,348,null,{"$f":"IF(ISERROR(VLOOKUP($B30&$AW$4&AR$25,【進行】結果入力表!$Q$7:$V$150,2,FALSE)),\"\",VLOOKUP($B30&$AW$4&AR$25,【進行】結果入力表!$Q$7:$V$150,2,FALSE))","v":113},null,0,1,0,5,461,null,460.99999999999994,null,{"$f":"IF(ISERROR(VLOOKUP($B30&$AW$4&BB$25,【進行】結果入力表!$Q$7:$V$150,2,FALSE)),\"\",VLOOKUP($B30&$AW$4&BB$25,【進行】結果入力表!$Q$7:$V$150,2,FALSE))","v":118},null,0,1,0,6,579,null,579,null,6,{"$f":"IF(ISERROR(VLOOKUP($B30&$I$4&F$25,【進行】結果入力表!$Q$7:$V$150,3,FALSE)),\"\",VLOOKUP($B30&$I$4&F$25,【進行】結果入力表!$Q$7:$V$150,3,FALSE))","v":""},{"$f":"IF(ISERROR(VLOOKUP($B30&$I$4&N$25,【進行】結果入力表!$Q$7:$V$150,3,FALSE)),\"\",VLOOKUP($B30&$I$4&N$25,【進行】結果入力表!$Q$7:$V$150,3,FALSE))","v":""},{"$f":"IF(ISERROR(VLOOKUP($B30&$AC$4&X$25,【進行】結果入力表!$Q$7:$V$150,3,FALSE)),\"\",VLOOKUP($B30&$AC$4&X$25,【進行】結果入力表!$Q$7:$V$150,3,FALSE))","v":""},{"$f":"IF(ISERROR(VLOOKUP($B30&$AC$4&AH$25,【進行】結果入力表!$Q$7:$V$150,3,FALSE)),\"\",VLOOKUP($B30&$AC$4&AH$25,【進行】結果入力表!$Q$7:$V$150,3,FALSE))","v":""},{"$f":"IF(ISERROR(VLOOKUP($B30&$AW$4&AR$25,【進行】結果入力表!$Q$7:$V$150,3,FALSE)),\"\",VLOOKUP($B30&$AW$4&AR$25,【進行】結果入力表!$Q$7:$V$150,3,FALSE))","v":""},{"$f":"IF(ISERROR(VLOOKUP($B30&$AW$4&BB$25,【進行】結果入力表!$Q$7:$V$150,3,FALSE)),\"\",VLOOKUP($B30&$AW$4&BB$25,【進行】結果入力表!$Q$7:$V$150,3,FALSE))","v":""},null,0,0,0,0,7,"長谷川　進","NRC",0,null,{"$f":"COUNTIF(F30:BC30,\"w\")","v":0},{"$f":"COUNT(F30,N30,AH30,X30,AR30,BB30)","v":6},{"$f":"CC30*180+SUM(F30,N30,AH30,X30,AR30,BB30)*180/E30","v":579},{"$f":"CC30*100000+CE30","v":579},null,null,null,null,null,null,null,null,null,null,null,null,0]
[null,{"$f":"IF(【準備】登録!AK10=0,\"\",【準備】登録!AK10)","v":"宮野　早織"},null,null,{"$f":"IF(【準備】登録!U13=\"\",\"\",【準備】登録!U13)","v":140},{"$f":"IF(ISERROR(VLOOKUP($B31&$I$4&F$25,【進行】結果入力表!$Q$7:$V$150,2,FALSE)),\"\",VLOOKUP($B31&$I$4&F$25,【進行】結果入力表!$Q$7:$V$150,2,FALSE))","v":"W"},null,1,0,140,null,180,null,{"$f":"IF(ISERROR(VLOOKUP($B31&$I$4&N$25,【進行】結果入力表!$Q$7:$V$150,2,FALSE)),\"\",VLOOKUP($B31&$I$4&N$25,【進行】結果入力表!$Q$7:$V$150,2,FALSE))","v":17},null,0,1,1,1,157,null,201.85714285714286,null,{"$f":"IF(ISERROR(VLOOKUP($B31&$AC$4&X$25,【進行】結果入力表!$Q$7:$V$150,2,FALSE)),\"\",VLOOKUP($B31&$AC$4&X$25,【進行】結果入力表!$Q$7:$V$150,2,FALSE))","v":102},null,0,1,1,2,259,null,333,null,{"$f":"IF(ISERROR(VLOOKUP($B31&$AC$4&AH$25,【進行】結果入力表!$Q$7:$V$150,2,FALSE)),\"\",VLOOKUP($B31&$AC$4&AH$25,【進行】結果入力表!$Q$7:$V$150,2,FALSE))","v":56},null,0,1,1,3,315,null,405,null,{"$f":"IF(ISERROR(VLOOKUP($B31&$AW$4&AR$25,【進行】結果入力表!$Q$7:$V$150,2,FALSE)),\"\",VLOOKUP($B31&$AW$4&AR$25,【進行】結果入力表!$Q$7:$V$150,2,FALSE))","v":98},null,0,1,1,4,413,null,531,null,{"$f":"IF(ISERROR(VLOOKUP($B31&$AW$4&BB$25,【進行】結果入力表!$Q$7:$V$150,2,FALSE)),\"\",VLOOKUP($B31&$AW$4&BB$25,【進行】結果入力表!$Q$7:$V$150,2,FALSE))","v":55},null,0,1,1,5,468,null,601.71428571428578,null,5,{"$f":"IF(ISERROR(VLOOKUP($B31&$I$4&F$25,【進行】結果入力表!$Q$7:$V$150,3,FALSE)),\"\",VLOOKUP($B31&$I$4&F$25,【進行】結果入力表!$Q$7:$V$150,3,FALSE))","v":""},{"$f":"IF(ISERROR(VLOOKUP($B31&$I$4&N$25,【進行】結果入力表!$Q$7:$V$150,3,FALSE)),\"\",VLOOKUP($B31&$I$4&N$25,【進行】結果入力表!$Q$7:$V$150,3,FALSE))","v":""},{"$f":"IF(ISERROR(VLOOKUP($B31&$AC$4&X$25,【進行】結果入力表!$Q$7:$V$150,3,FALSE)),\"\",VLOOKUP($B31&$AC$4&X$25,【進行】結果入力表!$Q$7:$V$150,3,FALSE))","v":""},{"$f":"IF(ISERROR(VLOOKUP($B31&$AC$4&AH$25,【進行】結果入力表!$Q$7:$V$150,3,FALSE)),\"\",VLOOKUP($B31&$AC$4&AH$25,【進行】結果入力表!$Q$7:$V$150,3,FALSE))","v":""},{"$f":"IF(ISERROR(VLOOKUP($B31&$AW$4&AR$25,【進行】結果入力表!$Q$7:$V$150,3,FALSE)),\"\",VLOOKUP($B31&$AW$4&AR$25,【進行】結果入力表!$Q$7:$V$150,3,FALSE))","v":""},{"$f":"IF(ISERROR(VLOOKUP($B31&$AW$4&BB$25,【進行】結果入力表!$Q$7:$V$150,3,FALSE)),\"\",VLOOKUP($B31&$AW$4&BB$25,【進行】結果入力表!$Q$7:$V$150,3,FALSE))","v":""},null,0,0,0,0,7,"宮野　早織","NRC",0,null,{"$f":"IF(B31=\"\",\"\",COUNTIF(F31:BC31,\"w\"))","v":1},{"$f":"IF(B31=\"\",\"\",COUNT(F31,N31,AH31,X31,AR31,BB31))","v":5},{"$f":"IF(CC31=\"\",\"\",CC31*180+SUM(F31,N31,AH31,X31,AR31,BB31)*180/E31)","v":601.71428571428578},{"$f":"IF(B31=\"\",\"\",CC31*100000+CE31)","v":100601.71428571429},null,null,null,null,null,null,{"$f":"【結果】リーグ成績表!M30","v":116},{"$f":"【結果】リーグ成績表!M31","v":"W"},{"$f":"【結果】リーグ成績表!AI30","v":"W"},{"$f":"【結果】リーグ成績表!AI31","v":"W"},{"$f":"【結果】リーグ成績表!BE30","v":"W"},{"$f":"【結果】リーグ成績表!BE31","v":"W"},{"$f":"SUM(CM31:CR31)","v":116}]
[null,{"$f":"IF(【準備】登録!AK11=0,\"\",【準備】登録!AK11)","v":""},null,null,{"$f":"IF(【準備】登録!X13=\"\",\"\",【準備】登録!X13)","v":""},{"$f":"IF(ISERROR(VLOOKUP($B32&$I$4&F$25,【進行】結果入力表!$Q$7:$V$150,2,FALSE)),\"\",VLOOKUP($B32&$I$4&F$25,【進行】結果入力表!$Q$7:$V$150,2,FALSE))","v":""},null,"","","",null,"",null,{"$f":"IF(ISERROR(VLOOKUP($B32&$I$4&N$25,【進行】結果入力表!$Q$7:$V$150,2,FALSE)),\"\",VLOOKUP($B32&$I$4&N$25,【進行】結果入力表!$Q$7:$V$150,2,FALSE))","v":""},null,"","","","","",null,"",null,{"$f":"IF(ISERROR(VLOOKUP($B32&$AC$4&X$25,【進行】結果入力表!$Q$7:$V$150,2,FALSE)),\"\",VLOOKUP($B32&$AC$4&X$25,【進行】結果入力表!$Q$7:$V$150,2,FALSE))","v":""},null,"","","","","",null,"",null,{"$f":"IF(ISERROR(VLOOKUP($B32&$AC$4&AH$25,【進行】結果入力表!$Q$7:$V$150,2,FALSE)),\"\",VLOOKUP($B32&$AC$4&AH$25,【進行】結果入力表!$Q$7:$V$150,2,FALSE))","v":""},null,"","","","","",null,"",null,{"$f":"IF(ISERROR(VLOOKUP($B32&$AW$4&AR$25,【進行】結果入力表!$Q$7:$V$150,2,FALSE)),\"\",VLOOKUP($B32&$AW$4&AR$25,【進行】結果入力表!$Q$7:$V$150,2,FALSE))","v":""},null,"","","","","",null,"",null,{"$f":"IF(ISERROR(VLOOKUP($B32&$AW$4&BB$25,【進行】結果入力表!$Q$7:$V$150,2,FALSE)),\"\",VLOOKUP($B32&$AW$4&BB$25,【進行】結果入力表!$Q$7:$V$150,2,FALSE))","v":""},null,"","","","","",null,"",null,"",{"$f":"IF(ISERROR(VLOOKUP($B32&$I$4&F$25,【進行】結果入力表!$Q$7:$V$150,3,FALSE)),\"\",VLOOKUP($B32&$I$4&F$25,【進行】結果入力表!$Q$7:$V$150,3,FALSE))","v":""},{"$f":"IF(ISERROR(VLOOKUP($B32&$I$4&N$25,【進行】結果入力表!$Q$7:$V$150,3,FALSE)),\"\",VLOOKUP($B32&$I$4&N$25,【進行】結果入力表!$Q$7:$V$150,3,FALSE))","v":""},{"$f":"IF(ISERROR(VLOOKUP($B32&$AC$4&X$25,【進行】結果入力表!$Q$7:$V$150,3,FALSE)),\"\",VLOOKUP($B32&$AC$4&X$25,【進行】結果入力表!$Q$7:$V$150,3,FALSE))","v":""},{"$f":"IF(ISERROR(VLOOKUP($B32&$AC$4&AH$25,【進行】結果入力表!$Q$7:$V$150,3,FALSE)),\"\",VLOOKUP($B32&$AC$4&AH$25,【進行】結果入力表!$Q$7:$V$150,3,FALSE))","v":""},{"$f":"IF(ISERROR(VLOOKUP($B32&$AW$4&AR$25,【進行】結果入力表!$Q$7:$V$150,3,FALSE)),\"\",VLOOKUP($B32&$AW$4&AR$25,【進行】結果入力表!$Q$7:$V$150,3,FALSE))","v":""},{"$f":"IF(ISERROR(VLOOKUP($B32&$AW$4&BB$25,【進行】結果入力表!$Q$7:$V$150,3,FALSE)),\"\",VLOOKUP($B32&$AW$4&BB$25,【進行】結果入力表!$Q$7:$V$150,3,FALSE))","v":""},null,0,0,0,0,7,"","NRC",0,null,{"$f":"IF(B32=\"\",\"\",COUNTIF(F32:BC32,\"w\"))","v":""},{"$f":"IF(B32=\"\",\"\",COUNT(F32,N32,AH32,X32,AR32,BB32))","v":""},{"$f":"IF(CC32=\"\",\"\",CC32*180+SUM(F32,N32,AH32,X32,AR32,BB32)*180/E32)","v":""},{"$f":"IF(B32=\"\",\"\",CC32*100000+CE32)","v":""},null,null,null,null,null,null,null,null,null,null,null,null,0]
[null,{"$f":"IF(【準備】登録!AK12=0,\"\",【準備】登録!AK12)","v":""},null,null,{"$f":"IF(【準備】登録!$Y$13=\"\",\"\",【準備】登録!AA13)","v":""},{"$f":"IF(ISERROR(VLOOKUP($B33&$I$4&F$25,【進行】結果入力表!$Q$7:$V$150,2,FALSE)),\"\",VLOOKUP($B33&$I$4&F$25,【進行】結果入力表!$Q$7:$V$150,2,FALSE))","v":""},null,"","","",null,"",null,{"$f":"IF(ISERROR(VLOOKUP($B33&$I$4&N$25,【進行】結果入力表!$Q$7:$V$150,2,FALSE)),\"\",VLOOKUP($B33&$I$4&N$25,【進行】結果入力表!$Q$7:$V$150,2,FALSE))","v":""},null,"","","","","",null,"",null,{"$f":"IF(ISERROR(VLOOKUP($B33&$AC$4&X$25,【進行】結果入力表!$Q$7:$V$150,2,FALSE)),\"\",VLOOKUP($B33&$AC$4&X$25,【進行】結果入力表!$Q$7:$V$150,2,FALSE))","v":""},null,"","","","","",null,"",null,{"$f":"IF(ISERROR(VLOOKUP($B33&$AC$4&AH$25,【進行】結果入力表!$Q$7:$V$150,2,FALSE)),\"\",VLOOKUP($B33&$AC$4&AH$25,【進行】結果入力表!$Q$7:$V$150,2,FALSE))","v":""},null,"","","","","",null,"",null,{"$f":"IF(ISERROR(VLOOKUP($B33&$AW$4&AR$25,【進行】結果入力表!$Q$7:$V$150,2,FALSE)),\"\",VLOOKUP($B33&$AW$4&AR$25,【進行】結果入力表!$Q$7:$V$150,2,FALSE))","v":""},null,"","","","","",null,"",null,{"$f":"IF(ISERROR(VLOOKUP($B33&$AW$4&BB$25,【進行】結果入力表!$Q$7:$V$150,2,FALSE)),\"\",VLOOKUP($B33&$AW$4&BB$25,【進行】結果入力表!$Q$7:$V$150,2,FALSE))","v":""},null,"","","","","",null,"",null,"",{"$f":"IF(ISERROR(VLOOKUP($B33&$I$4&F$25,【進行】結果入力表!$Q$7:$V$150,3,FALSE)),\"\",VLOOKUP($B33&$I$4&F$25,【進行】結果入力表!$Q$7:$V$150,3,FALSE))","v":""},{"$f":"IF(ISERROR(VLOOKUP($B33&$I$4&N$25,【進行】結果入力表!$Q$7:$V$150,3,FALSE)),\"\",VLOOKUP($B33&$I$4&N$25,【進行】結果入力表!$Q$7:$V$150,3,FALSE))","v":""},{"$f":"IF(ISERROR(VLOOKUP($B33&$AC$4&X$25,【進行】結果入力表!$Q$7:$V$150,3,FALSE)),\"\",VLOOKUP($B33&$AC$4&X$25,【進行】結果入力表!$Q$7:$V$150,3,FALSE))","v":""},{"$f":"IF(ISERROR(VLOOKUP($B33&$AC$4&AH$25,【進行】結果入力表!$Q$7:$V$150,3,FALSE)),\"\",VLOOKUP($B33&$AC$4&AH$25,【進行】結果入力表!$Q$7:$V$150,3,FALSE))","v":""},{"$f":"IF(ISERROR(VLOOKUP($B33&$AW$4&AR$25,【進行】結果入力表!$Q$7:$V$150,3,FALSE)),\"\",VLOOKUP($B33&$AW$4&AR$25,【進行】結果入力表!$Q$7:$V$150,3,FALSE))","v":""},{"$f":"IF(ISERROR(VLOOKUP($B33&$AW$4&BB$25,【進行】結果入力表!$Q$7:$V$150,3,FALSE)),\"\",VLOOKUP($B33&$AW$4&BB$25,【進行】結果入力表!$Q$7:$V$150,3,FALSE))","v":""},null,0,0,0,0,7,"","NRC",0,null,{"$f":"IF(B33=\"\",\"\",COUNTIF(F33:BC33,\"w\"))","v":""},{"$f":"IF(B33=\"\",\"\",COUNT(F33,N33,AH33,X33,AR33,BB33))","v":""},{"$f":"IF(CC33=\"\",\"\",CC33*180+SUM(F33,N33,AH33,X33,AR33,BB33)*180/E33)","v":""},{"$f":"IF(B33=\"\",\"\",CC33*100000+CE33)","v":""},null,null,null,null,null,null,null,null,null,null,null,null,{"$f":"SUM(CM33:CR33)","v":0}]
[null,"Total",null,null,null,null,null,{"$f":"IF(COUNTBLANK(H26:H33)=8,\"\",SUM(H26:H33))","v":3},{"$f":"IF(COUNTBLANK(I26:I33)=8,\"\",SUM(I26:I33))","v":3},{"$f":"IF($B26=\"\",\"\",SUM(J26:J33))","v":735},{"$f":"IF($B26=\"\",\"\",SUM(K26:K33))","v":0},{"$f":"IF(COUNTBLANK(L26:L33)=8,\"\",SUM(L26:L33))","v":775},{"$f":"IF($B26=\"\",\"\",SUM(M26:M33))","v":0},null,null,{"$f":"SUM(P26:P33)","v":1},{"$f":"SUM(Q26:Q33)","v":5},{"$f":"IF(COUNTBLANK(R26:R33)=8,\"\",SUM(H34,P34))","v":4},{"$f":"IF(COUNTBLANK(S26:S33)=8,\"\",SUM(I34,Q34))","v":8},{"$f":"IF($B26=\"\",\"\",SUM(T26:T33))","v":1356},{"$f":"IF($B26=\"\",\"\",SUM(U26:U33))","v":0},{"$f":"IF(COUNTBLANK(V26:V33)=8,\"\",SUM(V26:V33))","v":1400.8571428571429},{"$f":"IF($B26=\"\",\"\",SUM(W26:W33))","v":0},null,null,{"$f":"SUM(Z26:Z33)","v":2},{"$f":"SUM(AA26:AA33)","v":4},{"$f":"IF(COUNTBLANK(AB26:AB33)=8,\"\",SUM(R34,Z34))","v":6},{"$f":"IF(COUNTBLANK(AC26:AC33)=8,\"\",SUM(S34,AA34))","v":12},{"$f":"IF($B26=\"\",\"\",SUM(AD26:AD33))","v":2038},{"$f":"IF($B26=\"\",\"\",SUM(AE26:AE33))","v":0},{"$f":"IF(COUNTBLANK(AF26:AF33)=8,\"\",SUM(AF26:AF33))","v":2112},{"$f":"IF($B26=\"\",\"\",SUM(AG26:AG33))","v":0},null,null,{"$f":"SUM(AJ26:AJ33)","v":1},{"$f":"SUM(AK26:AK33)","v":5},{"$f":"IF(COUNTBLANK(AL26:AL33)=8,\"\",SUM(AB34,AJ34))","v":7},{"$f":"IF(COUNTBLANK(AM26:AM33)=8,\"\",SUM(AC34,AK34))","v":17},{"$f":"IF($B26=\"\",\"\",SUM(AN26:AN33))","v":2558},{"$f":"IF($B26=\"\",\"\",SUM(AO26:AO33))","v":0},{"$f":"IF(COUNTBLANK(AP26:AP33)=8,\"\",SUM(AP26:AP33))","v":2648},{"$f":"IF($B26=\"\",\"\",SUM(AQ26:AQ33))","v":0},null,null,{"$f":"SUM(AT26:AT33)","v":3},{"$f":"SUM(AU26:AU33)","v":3},{"$f":"IF(COUNTBLANK(AV26:AV33)=8,\"\",SUM(AL34,AT34))","v":10},{"$f":"IF(COUNTBLANK(AW26:AW33)=8,\"\",SUM(AM34,AU34))","v":20},{"$f":"IF($B26=\"\",\"\",SUM(AX26:AX33))","v":3379},{"$f":"IF($B26=\"\",\"\",SUM(AY26:AY33))","v":0},{"$f":"IF(COUNTBLANK(AZ26:AZ33)=8,\"\",SUM(AZ26:AZ33))","v":3497},{"$f":"IF($B26=\"\",\"\",SUM(BA26:BA33))","v":0},null,null,{"$f":"SUM(BD26:BD33)","v":1},{"$f":"SUM(BE26:BE33)","v":5},{"$f":"IF(COUNTBLANK(BF26:BF33)=8,\"\",SUM(AV34,BD34))","v":11},{"$f":"IF(COUNTBLANK(BG26:BG33)=8,\"\",SUM(AW34,BE34))","v":25},{"$f":"IF(COUNTIF(BH26:BI33,\"\")=16,\"\",SUM(BH26:BH33))","v":4050},{"$f":"IF($B26=\"\",\"\",SUM(BI26:BI33))","v":0},{"$f":"IF(COUNTBLANK(BJ26:BJ33)=8,\"\",SUM(BJ26:BJ33))","v":4183.7142857142862},{"$f":"IF($B26=\"\",\"\",SUM(BK26:BK33))","v":0},null,null,null,null,null,null,null,null,null,null,null,null,null,null,null,null,null,{"$f":"SUM(CC26:CC33)","v":11},{"$f":"SUM(CD26:CD33)","v":25},{"$f":"SUM(CE26:CE33)","v":4183.7142857142862},{"$f":"SUM(CF26:CF33)","v":1104183.7142857143}]
[null,"※","TPの数字は、ハンデによる換算後の得点を示す。"]

{"sheet":"【進行】結果入力表","index":3,"n_rows":150,"n_cols":22,"rows_kept":150,"cut":false,"hidden":false,"merged":[]}
[]
[]
[]
[]
[]
["節","G-No","所属A","選手名A","HR","得点","得点","HR","選手名B","所属B",null,"レフリー",null,null,null,"No","Name","本人","HR","相手","相手持点","基本持点"]
[{"$f":"\"第\"&【準備】登録!AE51&\"節\"","v":"第1節"},{"$f":"【準備】登録!AF51","v":1},{"$f":"【準備】登録!AI51","v":"HRC"},{"$f":"【準備】登録!AK51","v":"高木　俊行"},109,130,"W",null,{"$f":"【準備】登録!AL51","v":"林　秀忠"},{"$f":"【準備】登録!AN51","v":"SBC"},null,{"$f":"C13","v":"NRC"},{"$f":"D13","v":"岩本　剛"},null,null,{"$f":"B7","v":1},{"$f":"D7&【準備】登録!AE51&J7","v":"高木　俊行1SBC"},{"$f":"IF(F7=\"\",\"\",F7)","v":130},{"$f":"IF(E7=\"\",\"\",E7)","v":109},{"$f":"IF(G7=\"\",\"\",G7)","v":"W"},{"$f":"【準備】登録!AM51","v":180},{"$f":"【準備】登録!AJ51","v":180}]
[{"$f":"\"第\"&【準備】登録!AE52&\"節\"","v":"第1節"},{"$f":"【準備】登録!AF52","v":2},{"$f":"【準備】登録!AI52","v":"HRC"},{"$f":"【準備】登録!AK52","v":"金井　健太郎"},null,"W",60,null,{"$f":"【準備】登録!AL52","v":"秋田　倫央"},{"$f":"【準備】登録!AN52","v":"SBC"},null,{"$f":"C14","v":"NRC"},{"$f":"D14","v":"吉向　翔平"},null,null,{"$f":"B8","v":2},{"$f":"D8&【準備】登録!AE52&J8","v":"金井　健太郎1SBC"},{"$f":"IF(F8=\"\",\"\",F8)","v":"W"},{"$f":"IF(E8=\"\",\"\",E8)","v":""},{"$f":"IF(G8=\"\",\"\",G8)","v":60},{"$f":"【準備】登録!AM52","v":180},{"$f":"【準備】登録!AJ52","v":180}]
[{"$f":"\"第\"&【準備】登録!AE53&\"節\"","v":"第1節"},{"$f":"【準備】登録!AF53","v":3},{"$f":"【準備】登録!AI53","v":"HRC"},{"$f":"【準備】登録!AK53","v":"平井　洸志"},null,161,"W",null,{"$f":"【準備】登録!AL53","v":"大橋　正寛"},{"$f":"【準備】登録!AN53","v":"SBC"},null,"NRC","金澤　茂昌",null,null,3,{"$f":"D9&【準備】登録!AE53&J9","v":"平井　洸志1SBC"},161,"","W",{"$f":"【準備】登録!AM53","v":180},{"$f":"【準備】登録!AJ53","v":180}]
[{"$f":"\"第\"&【準備】登録!AE54&\"節\"","v":"第1節"},{"$f":"【準備】登録!AF54","v":4},{"$f":"【準備】登録!AI54","v":"HRC"},{"$f":"【準備】登録!AK54","v":"中尾　亮太"},127,167,"W",null,{"$f":"【準備】登録!AL54","v":"大橋　義治"},{"$f":"【準備】登録!AN54","v":"SBC"},null,"NRC","植田　慎也",null,null,4,{"$f":"D10&【準備】登録!AE54&J10","v":"中尾　亮太1SBC"},167,127,"W",{"$f":"【準備】登録!AM54","v":180},{"$f":"【準備】登録!AJ54","v":180}]
[{"$f":"\"第\"&【準備】登録!AE55&\"節\"","v":"第1節"},{"$f":"【準備】登録!AF55","v":5},{"$f":"【準備】登録!AI55","v":"HRC"},{"$f":"【準備】登録!AK55","v":"宮本　一"},null,"W",92,null,{"$f":"【準備】登録!AL55","v":"山中　康寛"},{"$f":"【準備】登録!AN55","v":"SBC"},null,"NRC","長谷川　進",null,null,5,{"$f":"D11&【準備】登録!AE55&J11","v":"宮本　一1SBC"},"W","",92,{"$f":"【準備】登録!AM55","v":180},{"$f":"【準備】登録!AJ55","v":180}]
[{"$f":"\"第\"&【準備】登録!AE56&\"節\"","v":"第1節"},{"$f":"【準備】登録!AF56","v":6},{"$f":"【準備】登録!AI56","v":"HRC"},{"$f":"【準備】登録!AK56","v":"河地　恵里"},null,113,"W",null,{"$f":"【準備】登録!AL56","v":"大橋　洋子"},{"$f":"【準備】登録!AN56","v":"SBC"},null,"NRC","宮野　早織",null,null,6,{"$f":"D12&【準備】登録!AE56&J12","v":"河地　恵里1SBC"},113,"","W",{"$f":"【準備】登録!AM56","v":140},{"$f":"【準備】登録!AJ56","v":140}]
[{"$f":"\"第\"&【準備】登録!AE57&\"節\"","v":"第1節"},{"$f":"【準備】登録!AF57","v":7},{"$f":"【準備】登録!AI57","v":"NRC"},{"$f":"【準備】登録!AK57","v":"岩本　剛"},null,43,"W",null,{"$f":"【準備】登録!AL57","v":"林　秀忠"},{"$f":"【準備】登録!AN57","v":"SBC"},null,{"$f":"C7","v":"HRC"},{"$f":"D7","v":"高木　俊行"},null,null,7,{"$f":"D13&【準備】登録!AE57&J13","v":"岩本　剛1SBC"},43,"","W",{"$f":"【準備】登録!AM57","v":180},{"$f":"【準備】登録!AJ57","v":180}]
[{"$f":"\"第\"&【準備】登録!AE58&\"節\"","v":"第1節"},{"$f":"【準備】登録!AF58","v":8},{"$f":"【準備】登録!AI58","v":"NRC"},{"$f":"【準備】登録!AK58","v":"吉向　翔平"},null,"W",46,null,{"$f":"【準備】登録!AL58","v":"秋田　倫央"},{"$f":"【準備】登録!AN58","v":"SBC"},null,{"$f":"C8","v":"HRC"},{"$f":"D8","v":"金井　健太郎"},null,null,8,{"$f":"D14&【準備】登録!AE58&J14","v":"吉向　翔平1SBC"},"W","",46,{"$f":"【準備】登録!AM58","v":180},{"$f":"【準備】登録!AJ58","v":180}]
[{"$f":"\"第\"&【準備】登録!AE59&\"節\"","v":"第1節"},{"$f":"【準備】登録!AF59","v":9},{"$f":"【準備】登録!AI59","v":"NRC"},{"$f":"【準備】登録!AK59","v":"金澤　茂昌"},null,"W",127,null,{"$f":"【準備】登録!AL59","v":"大橋　正寛"},{"$f":"【準備】登録!AN59","v":"SBC"},null,"HRC","平井　洸志",null,null,9,{"$f":"D15&【準備】登録!AE59&J15","v":"金澤　茂昌1SBC"},"W","",127,{"$f":"【準備】登録!AM59","v":180},{"$f":"【準備】登録!AJ59","v":180}]
[{"$f":"\"第\"&【準備】登録!AE60&\"節\"","v":"第1節"},{"$f":"【準備】登録!AF60","v":10},{"$f":"【準備】登録!AI60","v":"NRC"},{"$f":"【準備】登録!AK60","v":"植田　慎也"},null,39,"W",null,{"$f":"【準備】登録!AL60","v":"大橋　義治"},{"$f":"【準備】登録!AN60","v":"SBC"},null,"HRC","中尾　亮太",null,null,10,{"$f":"D16&【準備】登録!AE60&J16","v":"植田　慎也1SBC"},39,"","W",{"$f":"【準備】登録!AM60","v":180},{"$f":"【準備】登録!AJ60","v":180}]
[{"$f":"\"第\"&【準備】登録!AE61&\"節\"","v":"第1節"},{"$f":"【準備】登録!AF61","v":11},{"$f":"【準備】登録!AI61","v":"NRC"},{"$f":"【準備】登録!AK61","v":"長谷川　進"},null,153,"W",null,{"$f":"【準備】登録!AL61","v":"山中　康寛"},{"$f":"【準備】登録!AN61","v":"SBC"},null,"HRC","宮本　一",null,null,11,{"$f":"D17&【準備】登録!AE61&J17","v":"長谷川　進1SBC"},153,"","W",{"$f":"【準備】登録!AM61","v":180},{"$f":"【準備】登録!AJ61","v":180}]
[{"$f":"\"第\"&【準備】登録!AE62&\"節\"","v":"第1節"},{"$f":"【準備】登録!AF62","v":12},{"$f":"【準備】登録!AI62","v":"NRC"},{"$f":"【準備】登録!AK62","v":"宮野　早織"},null,"W",116,null,{"$f":"【準備】登録!AL62","v":"大橋　洋子"},{"$f":"【準備】登録!AN62","v":"SBC"},null,"HRC","河地　恵里",null,null,12,{"$f":"D18&【準備】登録!AE62&J18","v":"宮野　早織1SBC"},"W","",116,{"$f":"【準備】登録!AM62","v":140},{"$f":"【準備】登録!AJ62","v":140}]
[{"$f":"\"第\"&【準備】登録!AE63&\"節\"","v":"第1節"},{"$f":"【準備】登録!AF63","v":13},{"$f":"【準備】登録!AI63","v":"NRC"},{"$f":"【準備】登録!AK63","v":"岩本　剛"},100,152,"W",null,{"$f":"【準備】登録!AL63","v":"高木　俊行"},{"$f":"【準備】登録!AN63","v":"HRC"},null,{"$f":"J7","v":"SBC"},{"$f":"I7","v":"林　秀忠"},null,null,13,{"$f":"D19&【準備】登録!AE63&J19","v":"岩本　剛1HRC"},152,100,"W",{"$f":"【準備】登録!AM63","v":180},{"$f":"【準備】登録!AJ63","v":180}]
[{"$f":"\"第\"&【準備】登録!AE64&\"節\"","v":"第1節"},{"$f":"【準備】登録!AF64","v":14},{"$f":"【準備】登録!AI64","v":"NRC"},{"$f":"【準備】登録!AK64","v":"吉向　翔平"},null,96,"W",null,{"$f":"【準備】登録!AL64","v":"金井　健太郎"},{"$f":"【準備】登録!AN64","v":"HRC"},null,{"$f":"J8","v":"SBC"},{"$f":"I8","v":"秋田　倫央"},null,null,14,{"$f":"D20&【準備】登録!AE64&J20","v":"吉向　翔平1HRC"},96,"","W",{"$f":"【準備】登録!AM64","v":180},{"$f":"【準備】登録!AJ64","v":180}]
[{"$f":"\"第\"&【準備】登録!AE65&\"節\"","v":"第1節"},{"$f":"【準備】登録!AF65","v":15},{"$f":"【準備】登録!AI65","v":"NRC"},{"$f":"【準備】登録!AK65","v":"金澤　茂昌"},null,"W",93,null,{"$f":"【準備】登録!AL65","v":"平井　洸志"},{"$f":"【準備】登録!AN65","v":"HRC"},null,"SBC","大橋　正寛",null,null,15,{"$f":"D21&【準備】登録!AE65&J21","v":"金澤　茂昌1HRC"},"W","",93,{"$f":"【準備】登録!AM65","v":180},{"$f":"【準備】登録!AJ65","v":180}]
[{"$f":"\"第\"&【準備】登録!AE66&\"節\"","v":"第1節"},{"$f":"【準備】登録!AF66","v":16},{"$f":"【準備】登録!AI66","v":"NRC"},{"$f":"【準備】登録!AK66","v":"植田　慎也"},null,136,"W",null,{"$f":"【準備】登録!AL66","v":"中尾　亮太"},{"$f":"【準備】登録!AN66","v":"HRC"},null,"SBC","大橋　義治",null,null,16,{"$f":"D22&【準備】登録!AE66&J22","v":"植田　慎也1HRC"},136,"","W",{"$f":"【準備】登録!AM66","v":180},{"$f":"【準備】登録!AJ66","v":180}]
[{"$f":"\"第\"&【準備】登録!AE67&\"節\"","v":"第1節"},{"$f":"【準備】登録!AF67","v":17},{"$f":"【準備】登録!AI67","v":"NRC"},{"$f":"【準備】登録!AK67","v":"長谷川　進"},null,40,"W",null,{"$f":"【準備】登録!AL67","v":"宮本　一"},{"$f":"【準備】登録!AN67","v":"HRC"},null,"SBC","山中　康寛",null,null,17,{"$f":"D23&【準備】登録!AE67&J23","v":"長谷川　進1HRC"},40,"","W",{"$f":"【準備】登録!AM67","v":180},{"$f":"【準備】登録!AJ67","v":180}]
[{"$f":"\"第\"&【準備】登録!AE68&\"節\"","v":"第1節"},{"$f":"【準備】登録!AF68","v":18},{"$f":"【準備】登録!AI68","v":"NRC"},{"$f":"【準備】登録!AK68","v":"宮野　早織"},null,17,"W",null,{"$f":"【準備】登録!AL68","v":"河地　恵里"},{"$f":"【準備】登録!AN68","v":"HRC"},null,"SBC","大橋　洋子",null,null,18,{"$f":"D24&【準備】登録!AE68&J24","v":"宮野　早織1HRC"},17,"","W",{"$f":"【準備】登録!AM68","v":140},{"$f":"【準備】登録!AJ68","v":140}]
[{"$f":"\"第\"&【準備】登録!AE69&\"節\"","v":"第2節"},{"$f":"【準備】登録!AF69","v":19},{"$f":"【準備】登録!AI69","v":"HRC"},{"$f":"【準備】登録!AK69","v":"金井　健太郎"},null,167,"W",null,{"$f":"【準備】登録!AL69","v":"大橋　正寛"},{"$f":"【準備】登録!AN69","v":"SBC"},null,null,null,null,null,19,{"$f":"D25&【準備】登録!AE69&J25","v":"金井　健太郎2SBC"},167,"","W",{"$f":"【準備】登録!AM69","v":180},{"$f":"【準備】登録!AJ69","v":180}]
[{"$f":"\"第\"&【準備】登録!AE70&\"節\"","v":"第2節"},{"$f":"【準備】登録!AF70","v":20},{"$f":"【準備】登録!AI70","v":"HRC"},{"$f":"【準備】登録!AK70","v":"平井　洸志"},null,160,"W",null,{"$f":"【準備】登録!AL70","v":"大橋　義治"},{"$f":"【準備】登録!AN70","v":"SBC"},null,null,null,null,null,20,{"$f":"D26&【準備】登録!AE70&J26","v":"平井　洸志2SBC"},160,"","W",{"$f":"【準備】登録!AM70","v":180},{"$f":"【準備】登録!AJ70","v":180}]
[{"$f":"\"第\"&【準備】登録!AE71&\"節\"","v":"第2節"},{"$f":"【準備】登録!AF71","v":21},{"$f":"【準備】登録!AI71","v":"HRC"},{"$f":"【準備】登録!AK71","v":"中尾　亮太"},null,154,"W",null,{"$f":"【準備】登録!AL71","v":"山中　康寛"},{"$f":"【準備】登録!AN71","v":"SBC"},null,null,null,null,null,21,{"$f":"D27&【準備】登録!AE71&J27","v":"中尾　亮太2SBC"},154,"","W",{"$f":"【準備】登録!AM71","v":180},{"$f":"【準備】登録!AJ71","v":180}]
[{"$f":"\"第\"&【準備】登録!AE72&\"節\"","v":"第2節"},{"$f":"【準備】登録!AF72","v":22},{"$f":"【準備】登録!AI72","v":"HRC"},{"$f":"【準備】登録!AK72","v":"宮本　一"},null,"W",59,null,{"$f":"【準備】登録!AL72","v":"大橋　洋子"},{"$f":"【準備】登録!AN72","v":"SBC"},null,null,null,null,null,22,{"$f":"D28&【準備】登録!AE72&J28","v":"宮本　一2SBC"},"W","",59,{"$f":"【準備】登録!AM72","v":140},{"$f":"【準備】登録!AJ72","v":180}]
[{"$f":"\"第\"&【準備】登録!AE73&\"節\"","v":"第2節"},{"$f":"【準備】登録!AF73","v":23},{"$f":"【準備】登録!AI73","v":"HRC"},{"$f":"【準備】登録!AK73","v":"河地　恵里"},null,"W",154,null,{"$f":"【準備】登録!AL73","v":"林　秀忠"},{"$f":"【準備】登録!AN73","v":"SBC"},null,null,null,null,null,23,{"$f":"D29&【準備】登録!AE73&J29","v":"河地　恵里2SBC"},"W","",154,{"$f":"【準備】登録!AM73","v":180},{"$f":"【準備】登録!AJ73","v":140}]
[{"$f":"\"第\"&【準備】登録!AE74&\"節\"","v":"第2節"},{"$f":"【準備】登録!AF74","v":24},{"$f":"【準備】登録!AI74","v":"HRC"},{"$f":"【準備】登録!AK74","v":"高木　俊行"},null,128,"W",null,{"$f":"【準備】登録!AL74","v":"秋田　倫央"},{"$f":"【準備】登録!AN74","v":"SBC"},null,null,null,null,null,24,{"$f":"D30&【準備】登録!AE74&J30","v":"高木　俊行2SBC"},128,"","W",{"$f":"【準備】登録!AM74","v":180},{"$f":"【準備】登録!AJ74","v":180}]
[{"$f":"\"第\"&【準備】登録!AE75&\"節\"","v":"第2節"},{"$f":"【準備】登録!AF75","v":25},{"$f":"【準備】登録!AI75","v":"NRC"},{"$f":"【準備】登録!AK75","v":"岩本　剛"},null,45,"W",null,{"$f":"【準備】登録!AL75","v":"大橋　正寛"},{"$f":"【準備】登録!AN75","v":"SBC"},null,null,null,null,null,25,{"$f":"D31&【準備】登録!AE75&J31","v":"岩本　剛2SBC"},45,"","W",{"$f":"【準備】登録!AM75","v":180},{"$f":"【準備】登録!AJ75","v":180}]
[{"$f":"\"第\"&【準備】登録!AE76&\"節\"","v":"第2節"},{"$f":"【準備】登録!AF76","v":26},{"$f":"【準備】登録!AI76","v":"NRC"},{"$f":"【準備】登録!AK76","v":"吉向　翔平"},null,130,"W",null,{"$f":"【準備】登録!AL76","v":"大橋　義治"},{"$f":"【準備】登録!AN76","v":"SBC"},null,null,null,null,null,26,{"$f":"D32&【準備】登録!AE76&J32","v":"吉向　翔平2SBC"},130,"","W",{"$f":"【準備】登録!AM76","v":180},{"$f":"【準備】登録!AJ76","v":180}]
[{"$f":"\"第\"&【準備】登録!AE77&\"節\"","v":"第2節"},{"$f":"【準備】登録!AF77","v":27},{"$f":"【準備】登録!AI77","v":"NRC"},{"$f":"【準備】登録!AK77","v":"金澤　茂昌"},null,"W",164,null,{"$f":"【準備】登録!AL77","v":"山中　康寛"},{"$f":"【準備】登録!AN77","v":"SBC"},null,null,null,null,null,27,{"$f":"D33&【準備】登録!AE77&J33","v":"金澤　茂昌2SBC"},"W","",164,{"$f":"【準備】登録!AM77","v":180},{"$f":"【準備】登録!AJ77","v":180}]
[{"$f":"\"第\"&【準備】登録!AE78&\"節\"","v":"第2節"},{"$f":"【準備】登録!AF78","v":28},{"$f":"【準備】登録!AI78","v":"NRC"},{"$f":"【準備】登録!AK78","v":"植田　慎也"},null,"W",35,null,{"$f":"【準備】登録!AL78","v":"大橋　洋子"},{"$f":"【準備】登録!AN78","v":"SBC"},null,null,null,null,null,28,{"$f":"D34&【準備】登録!AE78&J34","v":"植田　慎也2SBC"},"W","",35,{"$f":"【準備】登録!AM78","v":140},{"$f":"【準備】登録!AJ78","v":180}]
[{"$f":"\"第\"&【準備】登録!AE79&\"節\"","v":"第2節"},{"$f":"【準備】登録!AF79","v":29},{"$f":"【準備】登録!AI79","v":"NRC"},{"$f":"【準備】登録!AK79","v":"長谷川　進"},null,45,"W",null,{"$f":"【準備】登録!AL79","v":"林　秀忠"},{"$f":"【準備】登録!AN79","v":"SBC"},null,null,null,null,null,29,{"$f":"D35&【準備】登録!AE79&J35","v":"長谷川　進2SBC"},45,"","W",{"$f":"【準備】登録!AM79","v":180},{"$f":"【準備】登録!AJ79","v":180}]
[{"$f":"\"第\"&【準備】登録!AE80&\"節\"","v":"第2節"},{"$f":"【準備】登録!AF80","v":30},{"$f":"【準備】登録!AI80","v":"NRC"},{"$f":"【準備】登録!AK80","v":"宮野　早織"},null,102,"W",null,{"$f":"【準備】登録!AL80","v":"秋田　倫央"},{"$f":"【準備】登録!AN80","v":"SBC"},null,null,null,null,null,30,{"$f":"D36&【準備】登録!AE80&J36","v":"宮野　早織2SBC"},102,"","W",{"$f":"【準備】登録!AM80","v":180},{"$f":"【準備】登録!AJ80","v":140}]
[{"$f":"\"第\"&【準備】登録!AE81&\"節\"","v":"第2節"},{"$f":"【準備】登録!AF81","v":31},{"$f":"【準備】登録!AI81","v":"NRC"},{"$f":"【準備】登録!AK81","v":"岩本　剛"},null,16,"W",null,{"$f":"【準備】登録!AL81","v":"金井　健太郎"},{"$f":"【準備】登録!AN81","v":"HRC"},null,null,null,null,null,31,{"$f":"D37&【準備】登録!AE81&J37","v":"岩本　剛2HRC"},16,"","W",{"$f":"【準備】登録!AM81","v":180},{"$f":"【準備】登録!AJ81","v":180}]
[{"$f":"\"第\"&【準備】登録!AE82&\"節\"","v":"第2節"},{"$f":"【準備】登録!AF82","v":32},{"$f":"【準備】登録!AI82","v":"NRC"},{"$f":"【準備】登録!AK82","v":"吉向　翔平"},null,"W",76,null,{"$f":"【準備】登録!AL82","v":"平井　洸志"},{"$f":"【準備】登録!AN82","v":"HRC"},null,null,null,null,null,32,{"$f":"D38&【準備】登録!AE82&J38","v":"吉向　翔平2HRC"},"W","",76,{"$f":"【準備】登録!AM82","v":180},{"$f":"【準備】登録!AJ82","v":180}]
[{"$f":"\"第\"&【準備】登録!AE83&\"節\"","v":"第2節"},{"$f":"【準備】登録!AF83","v":33},{"$f":"【準備】登録!AI83","v":"NRC"},{"$f":"【準備】登録!AK83","v":"金澤　茂昌"},null,102,"W",null,{"$f":"【準備】登録!AL83","v":"中尾　亮太"},{"$f":"【準備】登録!AN83","v":"HRC"},null,null,null,null,null,33,{"$f":"D39&【準備】登録!AE83&J39","v":"金澤　茂昌2HRC"},102,"","W",{"$f":"【準備】登録!AM83","v":180},{"$f":"【準備】登録!AJ83","v":180}]
[{"$f":"\"第\"&【準備】登録!AE84&\"節\"","v":"第2節"},{"$f":"【準備】登録!AF84","v":34},{"$f":"【準備】登録!AI84","v":"NRC"},{"$f":"【準備】登録!AK84","v":"植田　慎也"},null,56,"W",null,{"$f":"【準備】登録!AL84","v":"宮本　一"},{"$f":"【準備】登録!AN84","v":"HRC"},null,null,null,null,null,34,{"$f":"D40&【準備】登録!AE84&J40","v":"植田　慎也2HRC"},56,"","W",{"$f":"【準備】登録!AM84","v":180},{"$f":"【準備】登録!AJ84","v":180}]
[{"$f":"\"第\"&【準備】登録!AE85&\"節\"","v":"第2節"},{"$f":"【準備】登録!AF85","v":35},{"$f":"【準備】登録!AI85","v":"NRC"},{"$f":"【準備】登録!AK85","v":"長谷川　進"},null,110,"W",null,{"$f":"【準備】登録!AL85","v":"河地　恵里"},{"$f":"【準備】登録!AN85","v":"HRC"},null,null,null,null,null,35,{"$f":"D41&【準備】登録!AE85&J41","v":"長谷川　進2HRC"},110,"","W",{"$f":"【準備】登録!AM85","v":140},{"$f":"【準備】登録!AJ85","v":180}]
[{"$f":"\"第\"&【準備】登録!AE86&\"節\"","v":"第2節"},{"$f":"【準備】登録!AF86","v":36},{"$f":"【準備】登録!AI86","v":"NRC"},{"$f":"【準備】登録!AK86","v":"宮野　早織"},null,56,"W",null,{"$f":"【準備】登録!AL86","v":"高木　俊行"},{"$f":"【準備】登録!AN86","v":"HRC"},null,null,null,null,null,36,{"$f":"D42&【準備】登録!AE86&J42","v":"宮野　早織2HRC"},56,"","W",{"$f":"【準備】登録!AM86","v":180},{"$f":"【準備】登録!AJ86","v":140}]
[{"$f":"\"第\"&【準備】登録!AE87&\"節\"","v":"第3節"},{"$f":"【準備】登録!AF87","v":37},{"$f":"【準備】登録!AI87","v":"HRC"},{"$f":"【準備】登録!AK87","v":"平井　洸志"},null,"W",37,null,{"$f":"【準備】登録!AL87","v":"山中　康寛"},{"$f":"【準備】登録!AN87","v":"SBC"},null,null,null,null,null,37,{"$f":"D43&【準備】登録!AE87&J43","v":"平井　洸志3SBC"},"W","",37,{"$f":"【準備】登録!AM87","v":180},{"$f":"【準備】登録!AJ87","v":180}]
[{"$f":"\"第\"&【準備】登録!AE88&\"節\"","v":"第3節"},{"$f":"【準備】登録!AF88","v":38},{"$f":"【準備】登録!AI88","v":"HRC"},{"$f":"【準備】登録!AK88","v":"中尾　亮太"},null,88,"W",null,{"$f":"【準備】登録!AL88","v":"大橋　洋子"},{"$f":"【準備】登録!AN88","v":"SBC"},null,null,null,null,null,38,{"$f":"D44&【準備】登録!AE88&J44","v":"中尾　亮太3SBC"},88,"","W",{"$f":"【準備】登録!AM88","v":140},{"$f":"【準備】登録!AJ88","v":180}]
[{"$f":"\"第\"&【準備】登録!AE89&\"節\"","v":"第3節"},{"$f":"【準備】登録!AF89","v":39},{"$f":"【準備】登録!AI89","v":"HRC"},{"$f":"【準備】登録!AK89","v":"宮本　一"},null,130,"W",105,{"$f":"【準備】登録!AL89","v":"林　秀忠"},{"$f":"【準備】登録!AN89","v":"SBC"},null,null,null,null,null,39,{"$f":"D45&【準備】登録!AE89&J45","v":"宮本　一3SBC"},130,"","W",{"$f":"【準備】登録!AM89","v":180},{"$f":"【準備】登録!AJ89","v":180}]
[{"$f":"\"第\"&【準備】登録!AE90&\"節\"","v":"第3節"},{"$f":"【準備】登録!AF90","v":40},{"$f":"【準備】登録!AI90","v":"HRC"},{"$f":"【準備】登録!AK90","v":"河地　恵里"},null,79,"W",null,{"$f":"【準備】登録!AL90","v":"秋田　倫央"},{"$f":"【準備】登録!AN90","v":"SBC"},null,null,null,null,null,40,{"$f":"D46&【準備】登録!AE90&J46","v":"河地　恵里3SBC"},79,"","W",{"$f":"【準備】登録!AM90","v":180},{"$f":"【準備】登録!AJ90","v":140}]
[{"$f":"\"第\"&【準備】登録!AE91&\"節\"","v":"第3節"},{"$f":"【準備】登録!AF91","v":41},{"$f":"【準備】登録!AI91","v":"HRC"},{"$f":"【準備】登録!AK91","v":"高木　俊行"},null,47,"W",null,{"$f":"【準備】登録!AL91","v":"大橋　正寛"},{"$f":"【準備】登録!AN91","v":"SBC"},null,null,null,null,null,41,{"$f":"D47&【準備】登録!AE91&J47","v":"高木　俊行3SBC"},47,"","W",{"$f":"【準備】登録!AM91","v":180},{"$f":"【準備】登録!AJ91","v":180}]
[{"$f":"\"第\"&【準備】登録!AE92&\"節\"","v":"第3節"},{"$f":"【準備】登録!AF92","v":42},{"$f":"【準備】登録!AI92","v":"HRC"},{"$f":"【準備】登録!AK92","v":"金井　健太郎"},null,"W",91,null,{"$f":"【準備】登録!AL92","v":"大橋　義治"},{"$f":"【準備】登録!AN92","v":"SBC"},null,null,null,null,null,42,{"$f":"D48&【準備】登録!AE92&J48","v":"金井　健太郎3SBC"},"W","",91,{"$f":"【準備】登録!AM92","v":180},{"$f":"【準備】登録!AJ92","v":180}]
[{"$f":"\"第\"&【準備】登録!AE93&\"節\"","v":"第3節"},{"$f":"【準備】登録!AF93","v":43},{"$f":"【準備】登録!AI93","v":"NRC"},{"$f":"【準備】登録!AK93","v":"岩本　剛"},null,"W",83,null,{"$f":"【準備】登録!AL93","v":"山中　康寛"},{"$f":"【準備】登録!AN93","v":"SBC"},null,null,null,null,null,43,{"$f":"D49&【準備】登録!AE93&J49","v":"岩本　剛3SBC"},"W","",83,{"$f":"【準備】登録!AM93","v":180},{"$f":"【準備】登録!AJ93","v":180}]
[{"$f":"\"第\"&【準備】登録!AE94&\"節\"","v":"第3節"},{"$f":"【準備】登録!AF94","v":44},{"$f":"【準備】登録!AI94","v":"NRC"},{"$f":"【準備】登録!AK94","v":"吉向　翔平"},null,"W",111,null,{"$f":"【準備】登録!AL94","v":"大橋　洋子"},{"$f":"【準備】登録!AN94","v":"SBC"},null,null,null,null,null,44,{"$f":"D50&【準備】登録!AE94&J50","v":"吉向　翔平3SBC"},"W","",111,{"$f":"【準備】登録!AM94","v":140},{"$f":"【準備】登録!AJ94","v":180}]
[{"$f":"\"第\"&【準備】登録!AE95&\"節\"","v":"第3節"},{"$f":"【準備】登録!AF95","v":45},{"$f":"【準備】登録!AI95","v":"NRC"},{"$f":"【準備】登録!AK95","v":"金澤　茂昌"},null,70,"W",null,{"$f":"【準備】登録!AL95","v":"林　秀忠"},{"$f":"【準備】登録!AN95","v":"SBC"},null,null,null,null,null,45,{"$f":"D51&【準備】登録!AE95&J51","v":"金澤　茂昌3SBC"},70,"","W",{"$f":"【準備】登録!AM95","v":180},{"$f":"【準備】登録!AJ95","v":180}]
[{"$f":"\"第\"&【準備】登録!AE96&\"節\"","v":"第3節"},{"$f":"【準備】登録!AF96","v":46},{"$f":"【準備】登録!AI96","v":"NRC"},{"$f":"【準備】登録!AK96","v":"植田　慎也"},102,"W",168,null,{"$f":"【準備】登録!AL96","v":"秋田　倫央"},{"$f":"【準備】登録!AN96","v":"SBC"},null,null,null,null,null,46,{"$f":"D52&【準備】登録!AE96&J52","v":"植田　慎也3SBC"},"W",102,168,{"$f":"【準備】登録!AM96","v":180},{"$f":"【準備】登録!AJ96","v":180}]
[{"$f":"\"第\"&【準備】登録!AE97&\"節\"","v":"第3節"},{"$f":"【準備】登録!AF97","v":47},{"$f":"【準備】登録!AI97","v":"NRC"},{"$f":"【準備】登録!AK97","v":"長谷川　進"},null,113,"W",null,{"$f":"【準備】登録!AL97","v":"大橋　正寛"},{"$f":"【準備】登録!AN97","v":"SBC"},null,null,null,null,null,47,{"$f":"D53&【準備】登録!AE97&J53","v":"長谷川　進3SBC"},113,"","W",{"$f":"【準備】登録!AM97","v":180},{"$f":"【準備】登録!AJ97","v":180}]
[{"$f":"\"第\"&【準備】登録!AE98&\"節\"","v":"第3節"},{"$f":"【準備】登録!AF98","v":48},{"$f":"【準備】登録!AI98","v":"NRC"},{"$f":"【準備】登録!AK98","v":"宮野　早織"},null,98,"W",null,{"$f":"【準備】登録!AL98","v":"大橋　義治"},{"$f":"【準備】登録!AN98","v":"SBC"},null,null,null,null,null,48,{"$f":"D54&【準備】登録!AE98&J54","v":"宮野　早織3SBC"},98,"","W",{"$f":"【準備】登録!AM98","v":180},{"$f":"【準備】登録!AJ98","v":140}]
[{"$f":"\"第\"&【準備】登録!AE99&\"節\"","v":"第3節"},{"$f":"【準備】登録!AF99","v":49},{"$f":"【準備】登録!AI99","v":"NRC"},{"$f":"【準備】登録!AK99","v":"岩本　剛"},null,"W",49,null,{"$f":"【準備】登録!AL99","v":"平井　洸志"},{"$f":"【準備】登録!AN99","v":"HRC"},null,null,null,null,null,49,{"$f":"D55&【準備】登録!AE99&J55","v":"岩本　剛3HRC"},"W","",49,{"$f":"【準備】登録!AM99","v":180},{"$f":"【準備】登録!AJ99","v":180}]
[{"$f":"\"第\"&【準備】登録!AE100&\"節\"","v":"第3節"},{"$f":"【準備】登録!AF100","v":50},{"$f":"【準備】登録!AI100","v":"NRC"},{"$f":"【準備】登録!AK100","v":"吉向　翔平"},null,88,"W",null,{"$f":"【準備】登録!AL100","v":"中尾　亮太"},{"$f":"【準備】登録!AN100","v":"HRC"},null,null,null,null,null,50,{"$f":"D56&【準備】登録!AE100&J56","v":"吉向　翔平3HRC"},88,"","W",{"$f":"【準備】登録!AM100","v":180},{"$f":"【準備】登録!AJ100","v":180}]
[{"$f":"\"第\"&【準備】登録!AE101&\"節\"","v":"第3節"},{"$f":"【準備】登録!AF101","v":51},{"$f":"【準備】登録!AI101","v":"NRC"},{"$f":"【準備】登録!AK101","v":"金澤　茂昌"},null,147,"W",null,{"$f":"【準備】登録!AL101","v":"宮本　一"},{"$f":"【準備】登録!AN101","v":"HRC"},null,null,null,null,null,51,{"$f":"D57&【準備】登録!AE101&J57","v":"金澤　茂昌3HRC"},147,"","W",{"$f":"【準備】登録!AM101","v":180},{"$f":"【準備】登録!AJ101","v":180}]
[{"$f":"\"第\"&【準備】登録!AE102&\"節\"","v":"第3節"},{"$f":"【準備】登録!AF102","v":52},{"$f":"【準備】登録!AI102","v":"NRC"},{"$f":"【準備】登録!AK102","v":"植田　慎也"},null,83,"W",null,{"$f":"【準備】登録!AL102","v":"河地　恵里"},{"$f":"【準備】登録!AN102","v":"HRC"},null,null,null,null,null,52,{"$f":"D58&【準備】登録!AE102&J58","v":"植田　慎也3HRC"},83,"","W",{"$f":"【準備】登録!AM102","v":140},{"$f":"【準備】登録!AJ102","v":180}]
[{"$f":"\"第\"&【準備】登録!AE103&\"節\"","v":"第3節"},{"$f":"【準備】登録!AF103","v":53},{"$f":"【準備】登録!AI103","v":"NRC"},{"$f":"【準備】登録!AK103","v":"長谷川　進"},null,118,"W",null,{"$f":"【準備】登録!AL103","v":"高木　俊行"},{"$f":"【準備】登録!AN103","v":"HRC"},null,null,null,null,null,53,{"$f":"D59&【準備】登録!AE103&J59","v":"長谷川　進3HRC"},118,"","W",{"$f":"【準備】登録!AM103","v":180},{"$f":"【準備】登録!AJ103","v":180}]
[{"$f":"\"第\"&【準備】登録!AE104&\"節\"","v":"第3節"},{"$f":"【準備】登録!AF104","v":54},{"$f":"【準備】登録!AI104","v":"NRC"},{"$f":"【準備】登録!AK104","v":"宮野　早織"},null,55,"W",115,{"$f":"【準備】登録!AL104","v":"金井　健太郎"},{"$f":"【準備】登録!AN104","v":"HRC"},null,null,null,null,null,54,{"$f":"D60&【準備】登録!AE104&J60","v":"宮野　早織3HRC"},55,"","W",{"$f":"【準備】登録!AM104","v":180},{"$f":"【準備】登録!AJ104","v":140}]
[{"$f":"\"第\"&【準備】登録!AE105&\"節\"","v":{"$error":"#N/A"}},{"$f":"【準備】登録!AF105","v":55},{"$f":"【準備】登録!AI105","v":{"$error":"#N/A"}},{"$f":"【準備】登録!AK105","v":{"$error":"#N/A"}},null,null,null,null,{"$f":"【準備】登録!AL105","v":{"$error":"#N/A"}},{"$f":"【準備】登録!AN105","v":{"$error":"#N/A"}},null,null,null,null,null,55,{"$f":"D61&【準備】登録!AE105&J61","v":{"$error":"#N/A"}},"","","",{"$f":"【準備】登録!AM105","v":{"$error":"#N/A"}},{"$f":"【準備】登録!AJ105","v":{"$error":"#N/A"}}]
[{"$f":"\"第\"&【準備】登録!AE106&\"節\"","v":{"$error":"#N/A"}},{"$f":"【準備】登録!AF106","v":56},{"$f":"【準備】登録!AI106","v":{"$error":"#N/A"}},{"$f":"【準備】登録!AK106","v":{"$error":"#N/A"}},null,null,null,null,{"$f":"【準備】登録!AL106","v":{"$error":"#N/A"}},{"$f":"【準備】登録!AN106","v":{"$error":"#N/A"}},null,null,null,null,null,56,{"$f":"D62&【準備】登録!AE106&J62","v":{"$error":"#N/A"}},"","","",{"$f":"【準備】登録!AM106","v":{"$error":"#N/A"}},{"$f":"【準備】登録!AJ106","v":{"$error":"#N/A"}}]
[{"$f":"\"第\"&【準備】登録!AE107&\"節\"","v":{"$error":"#N/A"}},{"$f":"【準備】登録!AF107","v":57},{"$f":"【準備】登録!AI107","v":{"$error":"#N/A"}},{"$f":"【準備】登録!AK107","v":{"$error":"#N/A"}},null,null,null,null,{"$f":"【準備】登録!AL107","v":{"$error":"#N/A"}},{"$f":"【準備】登録!AN107","v":{"$error":"#N/A"}},null,null,null,null,null,57,{"$f":"D63&【準備】登録!AE107&J63","v":{"$error":"#N/A"}},"","","",{"$f":"【準備】登録!AM107","v":{"$error":"#N/A"}},{"$f":"【準備】登録!AJ107","v":{"$error":"#N/A"}}]
[{"$f":"\"第\"&【準備】登録!AE108&\"節\"","v":{"$error":"#N/A"}},{"$f":"【準備】登録!AF108","v":58},{"$f":"【準備】登録!AI108","v":{"$error":"#N/A"}},{"$f":"【準備】登録!AK108","v":{"$error":"#N/A"}},null,null,null,null,{"$f":"【準備】登録!AL108","v":{"$error":"#N/A"}},{"$f":"【準備】登録!AN108","v":{"$error":"#N/A"}},null,null,null,null,null,58,{"$f":"D64&【準備】登録!AE108&J64","v":{"$error":"#N/A"}},"","","",{"$f":"【準備】登録!AM108","v":{"$error":"#N/A"}},{"$f":"【準備】登録!AJ108","v":{"$error":"#N/A"}}]
[{"$f":"\"第\"&【準備】登録!AE109&\"節\"","v":{"$error":"#N/A"}},{"$f":"【準備】登録!AF109","v":59},{"$f":"【準備】登録!AI109","v":{"$error":"#N/A"}},{"$f":"【準備】登録!AK109","v":{"$error":"#N/A"}},null,null,null,null,{"$f":"【準備】登録!AL109","v":{"$error":"#N/A"}},{"$f":"【準備】登録!AN109","v":{"$error":"#N/A"}},null,null,null,null,null,59,{"$f":"D65&【準備】登録!AE109&J65","v":{"$error":"#N/A"}},"","","",{"$f":"【準備】登録!AM109","v":{"$error":"#N/A"}},{"$f":"【準備】登録!AJ109","v":{"$error":"#N/A"}}]
[{"$f":"\"第\"&【準備】登録!AE110&\"節\"","v":{"$error":"#N/A"}},{"$f":"【準備】登録!AF110","v":60},{"$f":"【準備】登録!AI110","v":{"$error":"#N/A"}},{"$f":"【準備】登録!AK110","v":{"$error":"#N/A"}},null,null,null,null,{"$f":"【準備】登録!AL110","v":{"$error":"#N/A"}},{"$f":"【準備】登録!AN110","v":{"$error":"#N/A"}},null,null,null,null,null,60,{"$f":"D66&【準備】登録!AE110&J66","v":{"$error":"#N/A"}},"","","",{"$f":"【準備】登録!AM110","v":{"$error":"#N/A"}},{"$f":"【準備】登録!AJ110","v":{"$error":"#N/A"}}]
[{"$f":"\"第\"&【準備】登録!AE111&\"節\"","v":{"$error":"#N/A"}},{"$f":"【準備】登録!AF111","v":61},{"$f":"【準備】登録!AI111","v":{"$error":"#N/A"}},{"$f":"【準備】登録!AK111","v":{"$error":"#N/A"}},null,null,null,null,{"$f":"【準備】登録!AL111","v":{"$error":"#N/A"}},{"$f":"【準備】登録!AN111","v":{"$error":"#N/A"}},null,null,null,null,null,61,{"$f":"D67&【準備】登録!AE111&J67","v":{"$error":"#N/A"}},"","","",{"$f":"【準備】登録!AM111","v":{"$error":"#N/A"}},{"$f":"【準備】登録!AJ111","v":{"$error":"#N/A"}}]
[{"$f":"\"第\"&【準備】登録!AE112&\"節\"","v":{"$error":"#N/A"}},{"$f":"【準備】登録!AF112","v":62},{"$f":"【準備】登録!AI112","v":{"$error":"#N/A"}},{"$f":"【準備】登録!AK112","v":{"$error":"#N/A"}},null,null,null,null,{"$f":"【準備】登録!AL112","v":{"$error":"#N/A"}},{"$f":"【準備】登録!AN112","v":{"$error":"#N/A"}},null,null,null,null,null,62,{"$f":"D68&【準備】登録!AE112&J68","v":{"$error":"#N/A"}},"","","",{"$f":"【準備】登録!AM112","v":{"$error":"#N/A"}},{"$f":"【準備】登録!AJ112","v":{"$error":"#N/A"}}]
[{"$f":"\"第\"&【準備】登録!AE113&\"節\"","v":{"$error":"#N/A"}},{"$f":"【準備】登録!AF113","v":63},{"$f":"【準備】登録!AI113","v":{"$error":"#N/A"}},{"$f":"【準備】登録!AK113","v":{"$error":"#N/A"}},null,null,null,null,{"$f":"【準備】登録!AL113","v":{"$error":"#N/A"}},{"$f":"【準備】登録!AN113","v":{"$error":"#N/A"}},null,{"$f":"J61","v":{"$error":"#N/A"}},{"$f":"I61","v":{"$error":"#N/A"}},null,null,63,{"$f":"D69&【準備】登録!AE113&J69","v":{"$error":"#N/A"}},"","","",{"$f":"【準備】登録!AM113","v":{"$error":"#N/A"}},{"$f":"【準備】登録!AJ113","v":{"$error":"#N/A"}}]
[{"$f":"\"第\"&【準備】登録!AE114&\"節\"","v":{"$error":"#N/A"}},{"$f":"【準備】登録!AF114","v":64},{"$f":"【準備】登録!AI114","v":{"$error":"#N/A"}},{"$f":"【準備】登録!AK114","v":{"$error":"#N/A"}},null,null,null,null,{"$f":"【準備】登録!AL114","v":{"$error":"#N/A"}},{"$f":"【準備】登録!AN114","v":{"$error":"#N/A"}},null,{"$error":"#N/A"},{"$error":"#N/A"},null,null,64,{"$f":"D70&【準備】登録!AE114&J70","v":{"$error":"#N/A"}},"","","",{"$f":"【準備】登録!AM114","v":{"$error":"#N/A"}},{"$f":"【準備】登録!AJ114","v":{"$error":"#N/A"}}]
[{"$f":"\"第\"&【準備】登録!AE115&\"節\"","v":{"$error":"#N/A"}},{"$f":"【準備】登録!AF115","v":65},{"$f":"【準備】登録!AI115","v":{"$error":"#N/A"}},{"$f":"【準備】登録!AK115","v":{"$error":"#N/A"}},null,null,null,null,{"$f":"【準備】登録!AL115","v":{"$error":"#N/A"}},{"$f":"【準備】登録!AN115","v":{"$error":"#N/A"}},null,{"$f":"C63","v":{"$error":"#N/A"}},{"$error":"#N/A"},null,null,65,{"$f":"D71&【準備】登録!AE115&J71","v":{"$error":"#N/A"}},"","","",{"$f":"【準備】登録!AM115","v":{"$error":"#N/A"}},{"$f":"【準備】登録!AJ115","v":{"$error":"#N/A"}}]
[{"$f":"\"第\"&【準備】登録!AE116&\"節\"","v":{"$error":"#N/A"}},{"$f":"【準備】登録!AF116","v":66},{"$f":"【準備】登録!AI116","v":{"$error":"#N/A"}},{"$f":"【準備】登録!AK116","v":{"$error":"#N/A"}},null,null,null,null,{"$f":"【準備】登録!AL116","v":{"$error":"#N/A"}},{"$f":"【準備】登録!AN116","v":{"$error":"#N/A"}},null,{"$error":"#N/A"},{"$error":"#N/A"},null,null,{"$f":"B72","v":66},{"$f":"D72&【準備】登録!AE116&J72","v":{"$error":"#N/A"}},{"$f":"IF(F72=\"\",\"\",F72)","v":""},{"$f":"IF(E72=\"\",\"\",E72)","v":""},{"$f":"IF(G72=\"\",\"\",G72)","v":""},{"$f":"【準備】登録!AM116","v":{"$error":"#N/A"}},{"$f":"【準備】登録!AJ116","v":{"$error":"#N/A"}}]
[{"$f":"\"第\"&【準備】登録!AE117&\"節\"","v":{"$error":"#N/A"}},{"$f":"【準備】登録!AF117","v":67},{"$f":"【準備】登録!AI117","v":{"$error":"#N/A"}},{"$f":"【準備】登録!AK117","v":{"$error":"#N/A"}},null,null,null,null,{"$f":"【準備】登録!AL117","v":{"$error":"#N/A"}},{"$f":"【準備】登録!AN117","v":{"$error":"#N/A"}},null,{"$error":"#N/A"},{"$error":"#N/A"},null,null,67,{"$f":"D73&【準備】登録!AE117&J73","v":{"$error":"#N/A"}},"","","",{"$f":"【準備】登録!AM117","v":{"$error":"#N/A"}},{"$f":"【準備】登録!AJ117","v":{"$error":"#N/A"}}]
[{"$f":"\"第\"&【準備】登録!AE118&\"節\"","v":{"$error":"#N/A"}},{"$f":"【準備】登録!AF118","v":68},{"$f":"【準備】登録!AI118","v":{"$error":"#N/A"}},{"$f":"【準備】登録!AK118","v":{"$error":"#N/A"}},null,null,null,null,{"$f":"【準備】登録!AL118","v":{"$error":"#N/A"}},{"$f":"【準備】登録!AN118","v":{"$error":"#N/A"}},null,{"$error":"#N/A"},{"$error":"#N/A"},null,null,68,{"$f":"D74&【準備】登録!AE118&J74","v":{"$error":"#N/A"}},"","","",{"$f":"【準備】登録!AM118","v":{"$error":"#N/A"}},{"$f":"【準備】登録!AJ118","v":{"$error":"#N/A"}}]
[{"$f":"\"第\"&【準備】登録!AE119&\"節\"","v":{"$error":"#N/A"}},{"$f":"【準備】登録!AF119","v":69},{"$f":"【準備】登録!AI119","v":{"$error":"#N/A"}},{"$f":"【準備】登録!AK119","v":{"$error":"#N/A"}},null,null,null,null,{"$f":"【準備】登録!AL119","v":{"$error":"#N/A"}},{"$f":"【準備】登録!AN119","v":{"$error":"#N/A"}},null,{"$error":"#N/A"},{"$error":"#N/A"},null,null,69,{"$f":"D75&【準備】登録!AE119&J75","v":{"$error":"#N/A"}},"","","",{"$f":"【準備】登録!AM119","v":{"$error":"#N/A"}},{"$f":"【準備】登録!AJ119","v":{"$error":"#N/A"}}]
[{"$f":"\"第\"&【準備】登録!AE120&\"節\"","v":{"$error":"#N/A"}},{"$f":"【準備】登録!AF120","v":70},{"$f":"【準備】登録!AI120","v":{"$error":"#N/A"}},{"$f":"【準備】登録!AK120","v":{"$error":"#N/A"}},null,null,null,null,{"$f":"【準備】登録!AL120","v":{"$error":"#N/A"}},{"$f":"【準備】登録!AN120","v":{"$error":"#N/A"}},null,{"$error":"#N/A"},{"$error":"#N/A"},null,null,70,{"$f":"D76&【準備】登録!AE120&J76","v":{"$error":"#N/A"}},"","","",{"$f":"【準備】登録!AM120","v":{"$error":"#N/A"}},{"$f":"【準備】登録!AJ120","v":{"$error":"#N/A"}}]
[{"$f":"\"第\"&【準備】登録!AE121&\"節\"","v":{"$error":"#N/A"}},{"$f":"【準備】登録!AF121","v":71},{"$f":"【準備】登録!AI121","v":{"$error":"#N/A"}},{"$f":"【準備】登録!AK121","v":{"$error":"#N/A"}},null,null,null,null,{"$f":"【準備】登録!AL121","v":{"$error":"#N/A"}},{"$f":"【準備】登録!AN121","v":{"$error":"#N/A"}},null,{"$error":"#N/A"},{"$error":"#N/A"},null,null,71,{"$f":"D77&【準備】登録!AE121&J77","v":{"$error":"#N/A"}},"","","",{"$f":"【準備】登録!AM121","v":{"$error":"#N/A"}},{"$f":"【準備】登録!AJ121","v":{"$error":"#N/A"}}]
[{"$f":"\"第\"&【準備】登録!AE122&\"節\"","v":{"$error":"#N/A"}},{"$f":"【準備】登録!AF122","v":72},{"$f":"【準備】登録!AI122","v":{"$error":"#N/A"}},{"$f":"【準備】登録!AK122","v":{"$error":"#N/A"}},null,null,null,null,{"$f":"【準備】登録!AL122","v":{"$error":"#N/A"}},{"$f":"【準備】登録!AN122","v":{"$error":"#N/A"}},null,{"$error":"#N/A"},{"$error":"#N/A"},null,null,72,{"$f":"D78&【準備】登録!AE122&J78","v":{"$error":"#N/A"}},"","","",{"$f":"【準備】登録!AM122","v":{"$error":"#N/A"}},{"$f":"【準備】登録!AJ122","v":{"$error":"#N/A"}}]
[null,null,null,null,null,null,null,null,null,null,null,null,null,null,null,{"$f":"P7","v":1},{"$f":"I7&【準備】登録!AE51&C7","v":"林　秀忠1HRC"},{"$f":"IF(G7=\"\",\"\",G7)","v":"W"},{"$f":"IF(H7=\"\",\"\",H7)","v":""},{"$f":"IF(F7=\"\",\"\",F7)","v":130},{"$f":"【準備】登録!AJ51","v":180},{"$f":"【準備】登録!AM51","v":180}]
[null,null,null,null,null,null,null,null,null,null,null,null,null,null,null,{"$f":"P8","v":2},{"$f":"I8&【準備】登録!AE52&C8","v":"秋田　倫央1HRC"},{"$f":"IF(G8=\"\",\"\",G8)","v":60},{"$f":"IF(H8=\"\",\"\",H8)","v":""},{"$f":"IF(F8=\"\",\"\",F8)","v":"W"},{"$f":"【準備】登録!AJ52","v":180},{"$f":"【準備】登録!AM52","v":180}]
[null,null,null,null,null,null,null,null,null,null,null,null,null,null,null,3,{"$f":"I9&【準備】登録!AE53&C9","v":"大橋　正寛1HRC"},"W","",161,{"$f":"【準備】登録!AJ53","v":180},{"$f":"【準備】登録!AM53","v":180}]
[null,null,null,null,null,null,null,null,null,null,null,null,null,null,null,4,{"$f":"I10&【準備】登録!AE54&C10","v":"大橋　義治1HRC"},"W","",167,{"$f":"【準備】登録!AJ54","v":180},{"$f":"【準備】登録!AM54","v":180}]
[null,null,null,null,null,null,null,null,null,null,null,null,null,null,null,5,{"$f":"I11&【準備】登録!AE55&C11","v":"山中　康寛1HRC"},92,"","W",{"$f":"【準備】登録!AJ55","v":180},{"$f":"【準備】登録!AM55","v":180}]
[null,null,null,null,null,null,null,null,null,null,null,null,null,null,null,6,{"$f":"I12&【準備】登録!AE56&C12","v":"大橋　洋子1HRC"},"W","",113,{"$f":"【準備】登録!AJ56","v":140},{"$f":"【準備】登録!AM56","v":140}]
[null,null,null,null,null,null,null,null,null,null,null,null,null,null,null,7,{"$f":"I13&【準備】登録!AE57&C13","v":"林　秀忠1NRC"},"W","",43,{"$f":"【準備】登録!AJ57","v":180},{"$f":"【準備】登録!AM57","v":180}]
[null,null,null,null,null,null,null,null,null,null,null,null,null,null,null,8,{"$f":"I14&【準備】登録!AE58&C14","v":"秋田　倫央1NRC"},46,"","W",{"$f":"【準備】登録!AJ58","v":180},{"$f":"【準備】登録!AM58","v":180}]
[null,null,null,null,null,null,null,null,null,null,null,null,null,null,null,9,{"$f":"I15&【準備】登録!AE59&C15","v":"大橋　正寛1NRC"},127,"","W",{"$f":"【準備】登録!AJ59","v":180},{"$f":"【準備】登録!AM59","v":180}]
[null,null,null,null,null,null,null,null,null,null,null,null,null,null,null,10,{"$f":"I16&【準備】登録!AE60&C16","v":"大橋　義治1NRC"},"W","",39,{"$f":"【準備】登録!AJ60","v":180},{"$f":"【準備】登録!AM60","v":180}]
[null,null,null,null,null,null,null,null,null,null,null,null,null,null,null,11,{"$f":"I17&【準備】登録!AE61&C17","v":"山中　康寛1NRC"},"W","",153,{"$f":"【準備】登録!AJ61","v":180},{"$f":"【準備】登録!AM61","v":180}]
[null,null,null,null,null,null,null,null,null,null,null,null,null,null,null,12,{"$f":"I18&【準備】登録!AE62&C18","v":"大橋　洋子1NRC"},116,"","W",{"$f":"【準備】登録!AJ62","v":140},{"$f":"【準備】登録!AM62","v":140}]
[null,null,null,null,null,null,null,null,null,null,null,null,null,null,null,13,{"$f":"I19&【準備】登録!AE63&C19","v":"高木　俊行1NRC"},"W","",152,{"$f":"【準備】登録!AJ63","v":180},{"$f":"【準備】登録!AM63","v":180}]
[null,null,null,null,null,null,null,null,null,null,null,null,null,null,null,14,{"$f":"I20&【準備】登録!AE64&C20","v":"金井　健太郎1NRC"},"W","",96,{"$f":"【準備】登録!AJ64","v":180},{"$f":"【準備】登録!AM64","v":180}]
[null,null,null,null,null,null,null,null,null,null,null,null,null,null,null,15,{"$f":"I21&【準備】登録!AE65&C21","v":"平井　洸志1NRC"},93,"","W",{"$f":"【準備】登録!AJ65","v":180},{"$f":"【準備】登録!AM65","v":180}]
[null,null,null,null,null,null,null,null,null,null,null,null,null,null,null,16,{"$f":"I22&【準備】登録!AE66&C22","v":"中尾　亮太1NRC"},"W","",136,{"$f":"【準備】登録!AJ66","v":180},{"$f":"【準備】登録!AM66","v":180}]
[null,null,null,null,null,null,null,null,null,null,null,null,null,null,null,17,{"$f":"I23&【準備】登録!AE67&C23","v":"宮本　一1NRC"},"W","",40,{"$f":"【準備】登録!AJ67","v":180},{"$f":"【準備】登録!AM67","v":180}]
[null,null,null,null,null,null,null,null,null,null,null,null,null,null,null,18,{"$f":"I24&【準備】登録!AE68&C24","v":"河地　恵里1NRC"},"W","",17,{"$f":"【準備】登録!AJ68","v":140},{"$f":"【準備】登録!AM68","v":140}]
[null,null,null,null,null,null,null,null,null,null,null,null,null,null,null,19,{"$f":"I25&【準備】登録!AE69&C25","v":"大橋　正寛2HRC"},"W","",167,{"$f":"【準備】登録!AJ69","v":180},{"$f":"【準備】登録!AM69","v":180}]
[null,null,null,null,null,null,null,null,null,null,null,null,null,null,null,20,{"$f":"I26&【準備】登録!AE70&C26","v":"大橋　義治2HRC"},"W","",160,{"$f":"【準備】登録!AJ70","v":180},{"$f":"【準備】登録!AM70","v":180}]
[null,null,null,null,null,null,null,null,null,null,null,null,null,null,null,21,{"$f":"I27&【準備】登録!AE71&C27","v":"山中　康寛2HRC"},"W","",154,{"$f":"【準備】登録!AJ71","v":180},{"$f":"【準備】登録!AM71","v":180}]
[null,null,null,null,null,null,null,null,null,null,null,null,null,null,null,22,{"$f":"I28&【準備】登録!AE72&C28","v":"大橋　洋子2HRC"},59,"","W",{"$f":"【準備】登録!AJ72","v":180},{"$f":"【準備】登録!AM72","v":140}]
[null,null,null,null,null,null,null,null,null,null,null,null,null,null,null,23,{"$f":"I29&【準備】登録!AE73&C29","v":"林　秀忠2HRC"},154,"","W",{"$f":"【準備】登録!AJ73","v":140},{"$f":"【準備】登録!AM73","v":180}]
[null,null,null,null,null,null,null,null,null,null,null,null,null,null,null,24,{"$f":"I30&【準備】登録!AE74&C30","v":"秋田　倫央2HRC"},"W","",128,{"$f":"【準備】登録!AJ74","v":180},{"$f":"【準備】登録!AM74","v":180}]
[null,null,null,null,null,null,null,null,null,null,null,null,null,null,null,25,{"$f":"I31&【準備】登録!AE75&C31","v":"大橋　正寛2NRC"},"W","",45,{"$f":"【準備】登録!AJ75","v":180},{"$f":"【準備】登録!AM75","v":180}]
[null,null,null,null,null,null,null,null,null,null,null,null,null,null,null,26,{"$f":"I32&【準備】登録!AE76&C32","v":"大橋　義治2NRC"},"W","",130,{"$f":"【準備】登録!AJ76","v":180},{"$f":"【準備】登録!AM76","v":180}]
[null,null,null,null,null,null,null,null,null,null,null,null,null,null,null,27,{"$f":"I33&【準備】登録!AE77&C33","v":"山中　康寛2NRC"},164,"","W",{"$f":"【準備】登録!AJ77","v":180},{"$f":"【準備】登録!AM77","v":180}]
[null,null,null,null,null,null,null,null,null,null,null,null,null,null,null,28,{"$f":"I34&【準備】登録!AE78&C34","v":"大橋　洋子2NRC"},35,"","W",{"$f":"【準備】登録!AJ78","v":180},{"$f":"【準備】登録!AM78","v":140}]
[null,null,null,null,null,null,null,null,null,null,null,null,null,null,null,29,{"$f":"I35&【準備】登録!AE79&C35","v":"林　秀忠2NRC"},"W","",45,{"$f":"【準備】登録!AJ79","v":180},{"$f":"【準備】登録!AM79","v":180}]
[null,null,null,null,null,null,null,null,null,null,null,null,null,null,null,30,{"$f":"I36&【準備】登録!AE80&C36","v":"秋田　倫央2NRC"},"W","",102,{"$f":"【準備】登録!AJ80","v":140},{"$f":"【準備】登録!AM80","v":180}]
[null,null,null,null,null,null,null,null,null,null,null,null,null,null,null,31,{"$f":"I37&【準備】登録!AE81&C37","v":"金井　健太郎2NRC"},"W","",16,{"$f":"【準備】登録!AJ81","v":180},{"$f":"【準備】登録!AM81","v":180}]
[null,null,null,null,null,null,null,null,null,null,null,null,null,null,null,32,{"$f":"I38&【準備】登録!AE82&C38","v":"平井　洸志2NRC"},76,"","W",{"$f":"【準備】登録!AJ82","v":180},{"$f":"【準備】登録!AM82","v":180}]
[null,null,null,null,null,null,null,null,null,null,null,null,null,null,null,33,{"$f":"I39&【準備】登録!AE83&C39","v":"中尾　亮太2NRC"},"W","",102,{"$f":"【準備】登録!AJ83","v":180},{"$f":"【準備】登録!AM83","v":180}]
[null,null,null,null,null,null,null,null,null,null,null,null,null,null,null,34,{"$f":"I40&【準備】登録!AE84&C40","v":"宮本　一2NRC"},"W","",56,{"$f":"【準備】登録!AJ84","v":180},{"$f":"【準備】登録!AM84","v":180}]
[null,null,null,null,null,null,null,null,null,null,null,null,null,null,null,35,{"$f":"I41&【準備】登録!AE85&C41","v":"河地　恵里2NRC"},"W","",110,{"$f":"【準備】登録!AJ85","v":180},{"$f":"【準備】登録!AM85","v":140}]
[null,null,null,null,null,null,null,null,null,null,null,null,null,null,null,36,{"$f":"I42&【準備】登録!AE86&C42","v":"高木　俊行2NRC"},"W","",56,{"$f":"【準備】登録!AJ86","v":140},{"$f":"【準備】登録!AM86","v":180}]
[null,null,null,null,null,null,null,null,null,null,null,null,null,null,null,37,{"$f":"I43&【準備】登録!AE87&C43","v":"山中　康寛3HRC"},37,"","W",{"$f":"【準備】登録!AJ87","v":180},{"$f":"【準備】登録!AM87","v":180}]
[null,null,null,null,null,null,null,null,null,null,null,null,null,null,null,38,{"$f":"I44&【準備】登録!AE88&C44","v":"大橋　洋子3HRC"},"W","",88,{"$f":"【準備】登録!AJ88","v":180},{"$f":"【準備】登録!AM88","v":140}]
[null,null,null,null,null,null,null,null,null,null,null,null,null,null,null,39,{"$f":"I45&【準備】登録!AE89&C45","v":"林　秀忠3HRC"},"W",105,130,{"$f":"【準備】登録!AJ89","v":180},{"$f":"【準備】登録!AM89","v":180}]
[null,null,null,null,null,null,null,null,null,null,null,null,null,null,null,40,{"$f":"I46&【準備】登録!AE90&C46","v":"秋田　倫央3HRC"},"W","",79,{"$f":"【準備】登録!AJ90","v":140},{"$f":"【準備】登録!AM90","v":180}]
[null,null,null,null,null,null,null,null,null,null,null,null,null,null,null,41,{"$f":"I47&【準備】登録!AE91&C47","v":"大橋　正寛3HRC"},"W","",47,{"$f":"【準備】登録!AJ91","v":180},{"$f":"【準備】登録!AM91","v":180}]
[null,null,null,null,null,null,null,null,null,null,null,null,null,null,null,42,{"$f":"I48&【準備】登録!AE92&C48","v":"大橋　義治3HRC"},91,"","W",{"$f":"【準備】登録!AJ92","v":180},{"$f":"【準備】登録!AM92","v":180}]
[null,null,null,null,null,null,null,null,null,null,null,null,null,null,null,43,{"$f":"I49&【準備】登録!AE93&C49","v":"山中　康寛3NRC"},83,"","W",{"$f":"【準備】登録!AJ93","v":180},{"$f":"【準備】登録!AM93","v":180}]
[null,null,null,null,null,null,null,null,null,null,null,null,null,null,null,44,{"$f":"I50&【準備】登録!AE94&C50","v":"大橋　洋子3NRC"},111,"","W",{"$f":"【準備】登録!AJ94","v":180},{"$f":"【準備】登録!AM94","v":140}]
[null,null,null,null,null,null,null,null,null,null,null,null,null,null,null,45,{"$f":"I51&【準備】登録!AE95&C51","v":"林　秀忠3NRC"},"W","",70,{"$f":"【準備】登録!AJ95","v":180},{"$f":"【準備】登録!AM95","v":180}]
[null,null,null,null,null,null,null,null,null,null,null,null,null,null,null,46,{"$f":"I52&【準備】登録!AE96&C52","v":"秋田　倫央3NRC"},168,"","W",{"$f":"【準備】登録!AJ96","v":180},{"$f":"【準備】登録!AM96","v":180}]
[null,null,null,null,null,null,null,null,null,null,null,null,null,null,null,47,{"$f":"I53&【準備】登録!AE97&C53","v":"大橋　正寛3NRC"},"W","",113,{"$f":"【準備】登録!AJ97","v":180},{"$f":"【準備】登録!AM97","v":180}]
[null,null,null,null,null,null,null,null,null,null,null,null,null,null,null,48,{"$f":"I54&【準備】登録!AE98&C54","v":"大橋　義治3NRC"},"W","",98,{"$f":"【準備】登録!AJ98","v":140},{"$f":"【準備】登録!AM98","v":180}]
[null,null,null,null,null,null,null,null,null,null,null,null,null,null,null,49,{"$f":"I55&【準備】登録!AE99&C55","v":"平井　洸志3NRC"},49,"","W",{"$f":"【準備】登録!AJ99","v":180},{"$f":"【準備】登録!AM99","v":180}]
[null,null,null,null,null,null,null,null,null,null,null,null,null,null,null,50,{"$f":"I56&【準備】登録!AE100&C56","v":"中尾　亮太3NRC"},"W","",88,{"$f":"【準備】登録!AJ100","v":180},{"$f":"【準備】登録!AM100","v":180}]
[null,null,null,null,null,null,null,null,null,null,null,null,null,null,null,51,{"$f":"I57&【準備】登録!AE101&C57","v":"宮本　一3NRC"},"W","",147,{"$f":"【準備】登録!AJ101","v":180},{"$f":"【準備】登録!AM101","v":180}]
[null,null,null,null,null,null,null,null,null,null,null,null,null,null,null,52,{"$f":"I58&【準備】登録!AE102&C58","v":"河地　恵里3NRC"},"W","",83,{"$f":"【準備】登録!AJ102","v":180},{"$f":"【準備】登録!AM102","v":140}]
[null,null,null,null,null,null,null,null,null,null,null,null,null,null,null,53,{"$f":"I59&【準備】登録!AE103&C59","v":"高木　俊行3NRC"},"W","",118,{"$f":"【準備】登録!AJ103","v":180},{"$f":"【準備】登録!AM103","v":180}]
[null,null,null,null,null,null,null,null,null,null,null,null,null,null,null,54,{"$f":"I60&【準備】登録!AE104&C60","v":"金井　健太郎3NRC"},"W",115,55,{"$f":"【準備】登録!AJ104","v":140},{"$f":"【準備】登録!AM104","v":180}]
[null,null,null,null,null,null,null,null,null,null,null,null,null,null,null,55,{"$f":"I61&【準備】登録!AE105&C61","v":{"$error":"#N/A"}},"","","",{"$f":"【準備】登録!AJ105","v":{"$error":"#N/A"}},{"$f":"【準備】登録!AM105","v":{"$error":"#N/A"}}]
[null,null,null,null,null,null,null,null,null,null,null,null,null,null,null,56,{"$f":"I62&【準備】登録!AE106&C62","v":{"$error":"#N/A"}},"","","",{"$f":"【準備】登録!AJ106","v":{"$error":"#N/A"}},{"$f":"【準備】登録!AM106","v":{"$error":"#N/A"}}]
[null,null,null,null,null,null,null,null,null,null,null,null,null,null,null,57,{"$f":"I63&【準備】登録!AE107&C63","v":{"$error":"#N/A"}},"","","",{"$f":"【準備】登録!AJ107","v":{"$error":"#N/A"}},{"$f":"【準備】登録!AM107","v":{"$error":"#N/A"}}]
[null,null,null,null,null,null,null,null,null,null,null,null,null,null,null,58,{"$f":"I64&【準備】登録!AE108&C64","v":{"$error":"#N/A"}},"","","",{"$f":"【準備】登録!AJ108","v":{"$error":"#N/A"}},{"$f":"【準備】登録!AM108","v":{"$error":"#N/A"}}]
[null,null,null,null,null,null,null,null,null,null,null,null,null,null,null,59,{"$f":"I65&【準備】登録!AE109&C65","v":{"$error":"#N/A"}},"","","",{"$f":"【準備】登録!AJ109","v":{"$error":"#N/A"}},{"$f":"【準備】登録!AM109","v":{"$error":"#N/A"}}]
[null,null,null,null,null,null,null,null,null,null,null,null,null,null,null,60,{"$f":"I66&【準備】登録!AE110&C66","v":{"$error":"#N/A"}},"","","",{"$f":"【準備】登録!AJ110","v":{"$error":"#N/A"}},{"$f":"【準備】登録!AM110","v":{"$error":"#N/A"}}]
[null,null,null,null,null,null,null,null,null,null,null,null,null,null,null,61,{"$f":"I67&【準備】登録!AE111&C67","v":{"$error":"#N/A"}},"","","",{"$f":"【準備】登録!AJ111","v":{"$error":"#N/A"}},{"$f":"【準備】登録!AM111","v":{"$error":"#N/A"}}]
[null,null,null,null,null,null,null,null,null,null,null,null,null,null,null,62,{"$f":"I68&【準備】登録!AE112&C68","v":{"$error":"#N/A"}},"","","",{"$f":"【準備】登録!AJ112","v":{"$error":"#N/A"}},{"$f":"【準備】登録!AM112","v":{"$error":"#N/A"}}]
[null,null,null,null,null,null,null,null,null,null,null,null,null,null,null,63,{"$f":"I69&【準備】登録!AE113&C69","v":{"$error":"#N/A"}},"","","",{"$f":"【準備】登録!AJ113","v":{"$error":"#N/A"}},{"$f":"【準備】登録!AM113","v":{"$error":"#N/A"}}]
[null,null,null,null,null,null,null,null,null,null,null,null,null,null,null,64,{"$f":"I70&【準備】登録!AE114&C70","v":{"$error":"#N/A"}},"","","",{"$f":"【準備】登録!AJ114","v":{"$error":"#N/A"}},{"$f":"【準備】登録!AM114","v":{"$error":"#N/A"}}]
[null,null,null,null,null,null,null,null,null,null,null,null,null,null,null,65,{"$f":"I71&【準備】登録!AE115&C71","v":{"$error":"#N/A"}},"","","",{"$f":"【準備】登録!AJ115","v":{"$error":"#N/A"}},{"$f":"【準備】登録!AM115","v":{"$error":"#N/A"}}]
[null,null,null,null,null,null,null,null,null,null,null,null,null,null,null,{"$f":"P72","v":66},{"$f":"I72&【準備】登録!AE116&C72","v":{"$error":"#N/A"}},{"$f":"IF(G72=\"\",\"\",G72)","v":""},{"$f":"IF(H72=\"\",\"\",H72)","v":""},{"$f":"IF(F72=\"\",\"\",F72)","v":""},{"$f":"【準備】登録!AJ116","v":{"$error":"#N/A"}},{"$f":"【準備】登録!AM116","v":{"$error":"#N/A"}}]
[null,null,null,null,null,null,null,null,null,null,null,null,null,null,null,67,{"$f":"I73&【準備】登録!AE117&C73","v":{"$error":"#N/A"}},"","","",{"$f":"【準備】登録!AJ117","v":{"$error":"#N/A"}},{"$f":"【準備】登録!AM117","v":{"$error":"#N/A"}}]
[null,null,null,null,null,null,null,null,null,null,null,null,null,null,null,68,{"$f":"I74&【準備】登録!AE118&C74","v":{"$error":"#N/A"}},"","","",{"$f":"【準備】登録!AJ118","v":{"$error":"#N/A"}},{"$f":"【準備】登録!AM118","v":{"$error":"#N/A"}}]
[null,null,null,null,null,null,null,null,null,null,null,null,null,null,null,69,{"$f":"I75&【準備】登録!AE119&C75","v":{"$error":"#N/A"}},"","","",{"$f":"【準備】登録!AJ119","v":{"$error":"#N/A"}},{"$f":"【準備】登録!AM119","v":{"$error":"#N/A"}}]
[null,null,null,null,null,null,null,null,null,null,null,null,null,null,null,70,{"$f":"I76&【準備】登録!AE120&C76","v":{"$error":"#N/A"}},"","","",{"$f":"【準備】登録!AJ120","v":{"$error":"#N/A"}},{"$f":"【準備】登録!AM120","v":{"$error":"#N/A"}}]
[null,null,null,null,null,null,null,null,null,null,null,null,null,null,null,71,{"$f":"I77&【準備】登録!AE121&C77","v":{"$error":"#N/A"}},"","","",{"$f":"【準備】登録!AJ121","v":{"$error":"#N/A"}},{"$f":"【準備】登録!AM121","v":{"$error":"#N/A"}}]
[null,null,null,null,null,null,null,null,null,null,null,null,null,null,null,72,{"$f":"I78&【準備】登録!AE122&C78","v":{"$error":"#N/A"}},"","","",{"$f":"【準備】登録!AJ122","v":{"$error":"#N/A"}},{"$f":"【準備】登録!AM122","v":{"$error":"#N/A"}}]

{"sheet":"【結果】リーグ成績表","index":4,"n_rows":43,"n_cols":66,"rows_kept":43,"cut":false,"hidden":false,"merged":[[3,16,3,17],[4,16,4,17],[5,16,5,17],[6,3,6,4],[3,5,3,6],[4,5,4,6],[5,5,5,6],[6,5,6,6],[3,3,3,4],[4,3,4,4],[4,8,4,9],[4,10,4,11],[4,12,4,13],[6,16,6,17],[5,8,5,9],[5,10,5,11],[5,12,5,13],[5,3,5,4],[8,16,8,17],[6,8,6,9],[6,10,6,11],[6,12,6,13],[8,3,8,4],[8,5,8,6],[14,3,14,4],[14,5,14,6],[14,8,14,9],[11,3,11,4],[11,5,11,6],[9,8,9,9],[9,10,9,11],[10,10,10,11],[9,16,9,17],[13,3,13,4],[13,5,13,6],[11,16,11,17],[10,3,10,4],[10,5,10,6],[10,8,10,9],[9,12,9,13],[9,3,9,4],[9,5,9,6],[11,8,11,9],[11,10,11,11],[10,12,10,13],[10,16,10,17],[16,16,16,17],[15,16,15,17],[14,10,14,11],[13,16,13,17],[14,12,14,13],[14,16,14,17],[11,12,11,13],[15,8,15,9],[15,10,15,11],[15,12,15,13],[16,12,16,13],[20,12,20,13],[16,3,16,4],[16,5,16,6],[16,8,16,9],[16,10,16,11],[20,3,20,4],[20,5,20,6],[20,8,20,9],[15,3,15,4],[15,5,15,6],[21,3,21,4],[21,5,21,6],[21,8,21,9],[21,10,21,11],[18,16,18,17],[19,12,19,13],[19,16,19,17],[21,12,21,13],[21,16,21,17],[20,16,20,17],[20,10,20,11],[19,3,19,4],[19,5,19,6],[19,8,19,9],[19,10,19,11],[18,3,18,4],[18,5,18,6],[23,3,23,4],[23,5,23,6],[25,12,25,13],[25,3,25,4],[25,5,25,6],[25,8,25,9],[25,10,25,11],[24,3,24,4],[24,5,24,6],[24,8,24,9],[23,16,23,17],[24,12,24,13],[24,16,24,17],[29,8,29,9],[29,10,29,11],[26,12,26,13],[26,16,26,17],[25,16,25,17],[24,10,24,11],[26,3,26,4],[26,5,26,6],[26,8,26,9],[26,10,26,11],[29,12,29,13],[29,16,29,17],[28,3,28,4],[28,5,28,6],[29,3,29,4],[29,5,29,6],[31,10,31,11],[34,3,34,4],[34,5,34,6],[34,8,34,9],[34,10,34,11],[33,3,33,4],[33,5,33,6],[30,10,30,11],[28,16,28,17],[30,8,30,9],[30,3,30,4],[30,5,30,6],[31,3,31,4],[31,5,31,6],[31,12,31,13],[31,16,31,17],[31,8,31,9],[35,16,35,17],[36,3,36,4],[36,5,36,6],[36,8,36,9],[36,10,36,11],[35,3,35,4],[35,5,35,6],[35,8,35,9],[35,10,35,11],[39,3,39,4],[39,5,39,6],[39,8,39,9],[39,10,39,11],[40,3,40,4],[40,5,40,6],[41,3,41,4],[41,5,41,6],[38,3,38,4],[38,5,38,6],[38,8,38,9],[38,10,38,11],[41,8,41,9],[41,10,41,11],[40,8,40,9],[40,10,40,11],[4,25,4,26],[4,27,4,28],[4,30,4,31],[9,25,9,26],[38,12,38,13],[38,16,38,17],[39,12,39,13],[39,16,39,17],[40,12,40,13],[40,16,40,17],[35,12,35,13],[30,12,30,13],[30,16,30,17],[41,12,41,13],[41,16,41,17],[33,16,33,17],[34,12,34,13],[34,16,34,17],[36,12,36,13],[36,16,36,17],[3,38,3,39],[4,34,4,35],[6,30,6,31],[6,32,6,33],[5,30,5,31],[5,38,5,39],[4,32,4,33],[4,38,4,39],[3,25,3,26],[3,27,3,28],[5,34,5,35],[5,32,5,33],[11,34,11,35],[11,38,11,39],[10,38,10,39],[9,32,9,33],[9,38,9,39],[8,25,8,26],[8,27,8,28],[10,34,10,35],[10,25,10,26],[10,27,10,28],[10,30,10,31],[10,32,10,33],[9,27,9,28],[9,30,9,31],[6,34,6,35],[6,38,6,39],[5,25,5,26],[5,27,5,28],[6,25,6,26],[6,27,6,28],[8,38,8,39],[9,34,9,35],[11,25,11,26],[11,27,11,28],[11,30,11,31],[11,32,11,33],[14,30,14,31],[14,32,14,33],[15,32,15,33],[13,38,13,39],[14,34,14,35],[14,38,14,39],[15,30,15,31],[18,27,18,28],[15,25,15,26],[15,27,15,28],[16,25,16,26],[16,27,16,28],[16,34,16,35],[16,38,16,39],[13,25,13,26],[13,27,13,28],[15,34,15,35],[15,38,15,39],[14,25,14,26],[14,27,14,28],[16,30,16,31],[16,32,16,33],[21,25,21,26],[21,27,21,28],[21,30,21,31],[21,32,21,33],[23,25,23,26],[23,27,23,28],[24,25,24,26],[24,27,24,28],[18,38,18,39],[19,34,19,35],[19,38,19,39],[21,34,21,35],[21,38,21,39],[20,38,20,39],[20,34,20,35],[20,25,20,26],[20,27,20,28],[20,30,20,31],[20,32,20,33],[19,25,19,26],[19,27,19,28],[19,30,19,31],[19,32,19,33],[18,25,18,26],[24,30,24,31],[24,32,24,33],[25,30,25,31],[24,38,24,39],[30,30,30,31],[30,32,30,33],[30,34,30,35],[23,38,23,39],[24,34,24,35],[26,32,26,33],[25,34,25,35],[31,38,31,39],[30,38,30,39],[29,32,29,33],[28,38,28,39],[29,34,29,35],[29,38,29,39],[29,25,29,26],[29,27,29,28],[29,30,29,31],[25,38,25,39],[26,34,26,35],[26,38,26,39],[25,25,25,26],[25,27,25,28],[25,32,25,33],[26,25,26,26],[28,25,28,26],[28,27,28,28],[30,25,30,26],[30,27,30,28],[31,25,31,26],[31,27,31,28],[31,30,31,31],[26,27,26,28],[26,30,26,31],[33,25,33,26],[33,27,33,28],[35,32,35,33],[31,32,31,33],[35,34,35,35],[35,38,35,39],[34,25,34,26],[34,27,34,28],[34,30,34,31],[34,32,34,33],[31,34,31,35],[33,38,33,39],[34,34,34,35],[41,25,41,26],[41,27,41,28],[41,30,41,31],[41,32,41,33],[38,32,38,33],[34,38,34,39],[36,34,36,35],[36,38,36,39],[41,34,41,35],[41,38,41,39],[38,38,38,39],[39,34,39,35],[39,38,39,39],[40,34,40,35],[35,25,35,26],[35,27,35,28],[38,34,38,35],[36,25,36,26],[36,27,36,28],[36,30,36,31],[36,32,36,33],[35,30,35,31],[38,27,38,28],[38,30,38,31],[40,38,40,39],[40,25,40,26],[40,27,40,28],[40,30,40,31],[40,32,40,33],[38,25,38,26],[39,25,39,26],[39,27,39,28],[39,30,39,31],[39,32,39,33],[3,47,3,48],[3,49,3,50],[5,56,5,57],[5,60,5,61],[4,47,4,48],[4,49,4,50],[4,52,4,53],[4,54,4,55],[3,60,3,61],[4,56,4,57],[4,60,4,61],[6,56,6,57],[6,60,6,61],[5,47,5,48],[5,49,5,50],[6,47,6,48],[6,49,6,50],[6,52,6,53],[6,54,6,55],[5,52,5,53],[5,54,5,55],[8,47,8,48],[8,49,8,50],[10,47,10,48],[10,49,10,50],[11,56,11,57],[11,60,11,61],[10,60,10,61],[9,54,9,55],[8,60,8,61],[9,56,9,57],[9,60,9,61],[10,56,10,57],[10,52,10,53],[10,54,10,55],[9,47,9,48],[9,49,9,50],[9,52,9,53],[11,47,11,48],[11,49,11,50],[11,52,11,53],[11,54,11,55],[14,52,14,53],[14,54,14,55],[13,47,13,48],[13,49,13,50],[14,47,14,48],[14,49,14,50],[16,54,16,55],[15,56,15,57],[15,60,15,61],[15,52,15,53],[15,54,15,55],[13,60,13,61],[14,56,14,57],[14,60,14,61],[15,47,15,48],[15,49,15,50],[19,60,19,61],[21,56,21,57],[21,60,21,61],[20,60,20,61],[20,56,20,57],[16,47,16,48],[16,49,16,50],[21,47,21,48],[21,49,21,50],[21,52,21,53],[21,54,21,55],[20,47,20,48],[20,49,20,50],[20,52,20,53],[20,54,20,55],[19,47,19,48],[19,49,19,50],[19,52,19,53],[19,54,19,55],[18,47,18,48],[18,49,18,50],[16,56,16,57],[16,60,16,61],[16,52,16,53],[25,47,25,48],[25,49,25,50],[26,47,26,48],[26,49,26,50],[26,52,26,53],[26,54,26,55],[25,52,25,53],[25,54,25,55],[23,47,23,48],[23,49,23,50],[24,47,24,48],[24,49,24,50],[24,52,24,53],[24,54,24,55],[28,47,28,48],[28,49,28,50],[31,56,31,57],[29,47,29,48],[29,49,29,50],[29,52,29,53],[30,47,30,48],[30,49,30,50],[30,52,30,53],[31,54,31,55],[29,56,29,57],[30,56,30,57],[33,47,33,48],[33,49,33,50],[36,47,36,48],[36,49,36,50],[36,52,36,53],[36,54,36,55],[35,47,35,48],[35,49,35,50],[31,60,31,61],[34,47,34,48],[34,49,34,50],[34,52,34,53],[34,54,34,55],[31,47,31,48],[31,49,31,50],[31,52,31,53],[1,58,1,65],[38,54,38,55],[33,60,33,61],[34,56,34,57],[34,60,34,61],[36,60,36,61],[29,54,29,55],[36,56,36,57],[35,56,35,57],[35,54,35,55],[38,56,38,57],[30,60,30,61],[30,54,30,55],[28,60,28,61],[29,60,29,61],[24,60,24,61],[26,56,26,57],[26,60,26,61],[25,56,25,57],[25,60,25,61],[23,60,23,61],[24,56,24,57],[18,60,18,61],[19,56,19,57],[40,47,40,48],[40,49,40,50],[41,47,41,48],[41,49,41,50],[38,60,38,61],[35,60,35,61],[35,52,35,53],[39,60,39,61],[39,54,39,55],[40,60,40,61],[41,54,41,55],[40,52,40,53],[40,54,40,55],[41,52,41,53],[41,56,41,57],[41,60,41,61],[40,56,40,57],[38,47,38,48],[38,49,38,50],[38,52,38,53],[39,47,39,48],[39,49,39,50],[39,52,39,53],[39,56,39,57]]}
[null,null,null,{"$f":"【結果】個人成績表!A1","v":"第9回　神奈滋対抗戦　　　(奈良；キングスポット)"}]
[null,null,null,null,null,null,null,null,null,null,null,null,null,null,null,null,null,null,null,null,null,null,null,null,null,null,null,null,null,null,null,null,null,null,null,null,null,null,null,null,null,null,null,null,null,null,null,null,null,null,null,null,null,null,null,null,null,null,{"$f":"【準備】登録!D4","v":"2021-03-21"}]
[null,null,null,1,"st  Section",null,null,null,null,null,null,null,null,null,null,null,null,null,null,null,null,null,null,null,null,2,"nd  Section",null,null,null,null,null,null,null,null,null,null,null,null,null,null,null,null,null,null,null,null,3,"rd  Section"]
[null,null,null,{"$f":"【準備】登録!D9","v":1},null,"Name",null,"持点",{"$f":"$D$5","v":"SBC"},null,{"$f":"$D$6","v":"HRC"},null,{"$f":"$D$7","v":"NRC"},null,"W","L","TP",null,"TP","LP","R_P","R",null,null,null,1,null,"Name",null,{"$f":"$H$4","v":"持点"},{"$f":"$D$5","v":"SBC"},null,{"$f":"$D$6","v":"HRC"},null,{"$f":"$D$7","v":"NRC"},null,"W","L","TP",null,"TP","LP","R_P","R",null,null,null,1,null,"Name",null,{"$f":"$H$4","v":"持点"},{"$f":"$D$5","v":"SBC"},null,{"$f":"$D$6","v":"HRC"},null,{"$f":"$D$7","v":"NRC"},null,"W","L","TP",null,"TP","LP","R_P","R"]
[3,1,null,{"$f":"IF(【準備】登録!$B$11=\"\",\"\",【準備】登録!$B$11)","v":"SBC"},null,{"$f":"VLOOKUP(VALUE(A5&B5),【準備】登録!$AI$5:$AL$28,3,FALSE)","v":"林　秀忠"},null,{"$f":"VLOOKUP(F5,【準備】登録!$AK$4:$AL$27,2,FALSE)","v":180},null,null,{"$f":"IF(ISERROR(VLOOKUP($F5&$D$3&K$4,【進行】結果入力表!$Q$7:$V$150,2,FALSE)),\"\",VLOOKUP($F5&$D$3&K$4,【進行】結果入力表!$Q$7:$V$150,2,FALSE))","v":"W"},null,{"$f":"IF(ISERROR(VLOOKUP($F5&$D$3&M$4,【進行】結果入力表!$Q$7:$V$150,2,FALSE)),\"\",VLOOKUP($F5&$D$3&M$4,【進行】結果入力表!$Q$7:$V$150,2,FALSE))","v":"W"},null,{"$f":"IF(M5=\"\",\"\",COUNTIF(I5:N5,\"w\"))","v":2},{"$f":"IF(M5=\"\",\"\",COUNT(K5,M5))","v":0},{"$f":"SUM(I5:N5)+O5*H5","v":360},null,{"$f":"IF(M5=\"\",\"\",Q5/H5*180)","v":360},{"$f":"IF(I6=\"w\",180,I6/H5*180)+IF(I7=\"w\",180,I7/H5*180)","v":173},{"$f":"O5*10000000+S5*O10004*10000000+S5*1000-T5","v":20359827},{"$f":"IF(M5=\"\",\"\",RANK(U5:U7,U5:U7,0))","v":1},null,3,3,{"$f":"IF(【準備】登録!$B$11=\"\",\"\",【準備】登録!$B$11)","v":"SBC"},null,{"$f":"VLOOKUP(VALUE(X5&Y5),【準備】登録!$AI$5:$AL$28,3,FALSE)","v":"大橋　正寛"},null,{"$f":"VLOOKUP(AB5,【準備】登録!$AK$4:$AL$27,2,FALSE)","v":180},null,null,{"$f":"IF(ISERROR(VLOOKUP($AB5&$Z$3&AG$4,【進行】結果入力表!$Q$7:$V$150,2,FALSE)),\"\",VLOOKUP($AB5&$Z$3&AG$4,【進行】結果入力表!$Q$7:$V$150,2,FALSE))","v":"W"},null,{"$f":"IF(ISERROR(VLOOKUP($AB5&$Z$3&AI$4,【進行】結果入力表!$Q$7:$V$150,2,FALSE)),\"\",VLOOKUP($AB5&$Z$3&AI$4,【進行】結果入力表!$Q$7:$V$150,2,FALSE))","v":"W"},null,{"$f":"IF(AI5=\"\",\"\",COUNTIF(AE5:AJ5,\"w\"))","v":2},{"$f":"IF(AI5=\"\",\"\",COUNT(AG5,AI5))","v":0},{"$f":"SUM(AE5:AJ5)+AK5*AD5","v":360},null,{"$f":"IF(AI5=\"\",\"\",AM5/AD5*180)","v":360},{"$f":"IF(AE6=\"w\",180,AE6/AD5*180)+IF(AE7=\"w\",180,AE7/AD5*180)","v":212},{"$f":"AK5*10000000+AO5*AK10004*10000000+AO5*1000-AP5","v":20359788},{"$f":"IF(AI5=\"\",\"\",RANK(AQ5:AQ7,AQ5:AQ7,0))","v":1},null,3,5,{"$f":"IF(【準備】登録!$B$11=\"\",\"\",【準備】登録!$B$11)","v":"SBC"},null,{"$f":"VLOOKUP(VALUE(AT5&AU5),【準備】登録!$AI$5:$AL$28,3,FALSE)","v":"山中　康寛"},null,{"$f":"VLOOKUP(AX5,【準備】登録!$AK$4:$AL$27,2,FALSE)","v":180},null,null,{"$f":"IF(ISERROR(VLOOKUP($AX5&$AV$3&BC$4,【進行】結果入力表!$Q$7:$V$150,2,FALSE)),\"\",VLOOKUP($AX5&$AV$3&BC$4,【進行】結果入力表!$Q$7:$V$150,2,FALSE))","v":37},null,{"$f":"IF(ISERROR(VLOOKUP($AX5&$AV$3&BE$4,【進行】結果入力表!$Q$7:$V$150,2,FALSE)),\"\",VLOOKUP($AX5&$AV$3&BE$4,【進行】結果入力表!$Q$7:$V$150,2,FALSE))","v":83},null,{"$f":"IF(BE5=\"\",\"\",COUNTIF(BA5:BF5,\"w\"))","v":0},{"$f":"IF(BE5=\"\",\"\",COUNT(BC5,BE5))","v":2},{"$f":"SUM(BA5:BF5)+BG5*AZ5","v":120},null,{"$f":"IF(BE5=\"\",\"\",BI5/AZ5*180)","v":120},{"$f":"IF(BA6=\"w\",180,BA6/AZ5*180)+IF(BA7=\"w\",180,BA7/AZ5*180)","v":360},{"$f":"BG5*10000000+BK5*BG10004*10000000+BK5*1000-BL5","v":119640},{"$f":"IF(BE5=\"\",\"\",RANK(BM5:BM7,BM5:BM7,0))","v":3}]
[2,1,null,{"$f":"IF(【準備】登録!$B$12=\"\",\"\",【準備】登録!$B$12)","v":"HRC"},null,{"$f":"VLOOKUP(VALUE(A6&B6),【準備】登録!$AI$5:$AL$28,3,FALSE)","v":"高木　俊行"},null,{"$f":"VLOOKUP(F6,【準備】登録!$AK$4:$AL$27,2,FALSE)","v":180},{"$f":"IF(ISERROR(VLOOKUP($F6&$D$3&I$4,【進行】結果入力表!$Q$7:$V$150,2,FALSE)),\"\",VLOOKUP($F6&$D$3&I$4,【進行】結果入力表!$Q$7:$V$150,2,FALSE))","v":130},null,null,null,{"$f":"IF(ISERROR(VLOOKUP($F6&$D$3&M$4,【進行】結果入力表!$Q$7:$V$150,2,FALSE)),\"\",VLOOKUP($F6&$D$3&M$4,【進行】結果入力表!$Q$7:$V$150,2,FALSE))","v":"W"},null,{"$f":"IF(M5=\"\",\"\",COUNTIF(I6:N6,\"w\"))","v":1},{"$f":"IF(M5=\"\",\"\",COUNT(I6,M6))","v":1},{"$f":"SUM(I6:N6)+O6*H6","v":310},null,{"$f":"IF(M5=\"\",\"\",Q6/H6*180)","v":310},{"$f":"IF(K5=\"w\",180,K5/H6*180)+IF(K7=\"w\",180,K7/H6*180)","v":332},{"$f":"O6*10000000+S6*O10005*10000000+S6*1000-T6","v":10309668},{"$f":"IF(M5=\"\",\"\",RANK(U5:U7,U5:U7,0))","v":2},null,2,2,{"$f":"IF(【準備】登録!$B$12=\"\",\"\",【準備】登録!$B$12)","v":"HRC"},null,{"$f":"VLOOKUP(VALUE(X6&Y6),【準備】登録!$AI$5:$AL$28,3,FALSE)","v":"金井　健太郎"},null,{"$f":"VLOOKUP(AB6,【準備】登録!$AK$4:$AL$27,2,FALSE)","v":180},{"$f":"IF(ISERROR(VLOOKUP($AB6&$Z$3&AE$4,【進行】結果入力表!$Q$7:$V$150,2,FALSE)),\"\",VLOOKUP($AB6&$Z$3&AE$4,【進行】結果入力表!$Q$7:$V$150,2,FALSE))","v":167},null,null,null,{"$f":"IF(ISERROR(VLOOKUP($AB6&$Z$3&AI$4,【進行】結果入力表!$Q$7:$V$150,2,FALSE)),\"\",VLOOKUP($AB6&$Z$3&AI$4,【進行】結果入力表!$Q$7:$V$150,2,FALSE))","v":"W"},null,{"$f":"IF(AI5=\"\",\"\",COUNTIF(AE6:AJ6,\"w\"))","v":1},{"$f":"IF(AI5=\"\",\"\",COUNT(AE6,AI6))","v":1},{"$f":"SUM(AE6:AJ6)+AK6*AD6","v":347},null,{"$f":"IF(AI5=\"\",\"\",AM6/AD6*180)","v":347},{"$f":"IF(AG5=\"w\",180,AG5/AD6*180)+IF(AG7=\"w\",180,AG7/AD6*180)","v":196},{"$f":"AK6*10000000+AO6*AK10005*10000000+AO6*1000-AP6","v":10346804},{"$f":"IF(AI5=\"\",\"\",RANK(AQ5:AQ7,AQ5:AQ7,0))","v":2},null,2,3,{"$f":"IF(【準備】登録!$B$12=\"\",\"\",【準備】登録!$B$12)","v":"HRC"},null,{"$f":"VLOOKUP(VALUE(AT6&AU6),【準備】登録!$AI$5:$AL$28,3,FALSE)","v":"平井　洸志"},null,{"$f":"VLOOKUP(AX6,【準備】登録!$AK$4:$AL$27,2,FALSE)","v":180},{"$f":"IF(ISERROR(VLOOKUP($AX6&$AV$3&BA$4,【進行】結果入力表!$Q$7:$V$150,2,FALSE)),\"\",VLOOKUP($AX6&$AV$3&BA$4,【進行】結果入力表!$Q$7:$V$150,2,FALSE))","v":"W"},null,null,null,{"$f":"IF(ISERROR(VLOOKUP($AX6&$AV$3&BE$4,【進行】結果入力表!$Q$7:$V$150,2,FALSE)),\"\",VLOOKUP($AX6&$AV$3&BE$4,【進行】結果入力表!$Q$7:$V$150,2,FALSE))","v":49},null,{"$f":"IF(BE5=\"\",\"\",COUNTIF(BA6:BF6,\"w\"))","v":1},{"$f":"IF(BE5=\"\",\"\",COUNT(BA6,BE6))","v":1},{"$f":"SUM(BA6:BF6)+BG6*AZ6","v":229},null,{"$f":"IF(BE5=\"\",\"\",BI6/AZ6*180)","v":229},{"$f":"IF(BC5=\"w\",180,BC5/AZ6*180)+IF(BC7=\"w\",180,BC7/AZ6*180)","v":217},{"$f":"BG6*10000000+BK6*BG10005*10000000+BK6*1000-BL6","v":10228783},{"$f":"IF(BE5=\"\",\"\",RANK(BM5:BM7,BM5:BM7,0))","v":2}]
[1,1,null,{"$f":"IF(【準備】登録!$B$13=\"\",\"\",【準備】登録!$B$13)","v":"NRC"},null,{"$f":"VLOOKUP(VALUE(A7&B7),【準備】登録!$AI$5:$AL$28,3,FALSE)","v":"岩本　剛"},null,{"$f":"VLOOKUP(F7,【準備】登録!$AK$4:$AL$27,2,FALSE)","v":180},{"$f":"IF(ISERROR(VLOOKUP($F7&$D$3&I$4,【進行】結果入力表!$Q$7:$V$150,2,FALSE)),\"\",VLOOKUP($F7&$D$3&I$4,【進行】結果入力表!$Q$7:$V$150,2,FALSE))","v":43},null,{"$f":"IF(ISERROR(VLOOKUP($F7&$D$3&K$4,【進行】結果入力表!$Q$7:$V$150,2,FALSE)),\"\",VLOOKUP($F7&$D$3&K$4,【進行】結果入力表!$Q$7:$V$150,2,FALSE))","v":152},null,null,null,{"$f":"IF(M5=\"\",\"\",COUNTIF(I7:N7,\"w\"))","v":0},{"$f":"IF(M5=\"\",\"\",COUNT(I7,K7))","v":2},{"$f":"SUM(I7:N7)+O7*H7","v":195},null,{"$f":"IF(M5=\"\",\"\",Q7/H7*180)","v":195},{"$f":"IF(M5=\"w\",180,M5/H7*180)+IF(M6=\"w\",180,M6/H7*180)","v":360},{"$f":"O7*10000000+S7*O10006*10000000+S7*1000-T7","v":194640},{"$f":"IF(M5=\"\",\"\",RANK(U5:U7,U5:U7,0))","v":3},null,1,1,{"$f":"IF(【準備】登録!$B$13=\"\",\"\",【準備】登録!$B$13)","v":"NRC"},null,{"$f":"VLOOKUP(VALUE(X7&Y7),【準備】登録!$AI$5:$AL$28,3,FALSE)","v":"岩本　剛"},null,{"$f":"VLOOKUP(AB7,【準備】登録!$AK$4:$AL$27,2,FALSE)","v":180},{"$f":"IF(ISERROR(VLOOKUP($AB7&$Z$3&AE$4,【進行】結果入力表!$Q$7:$V$150,2,FALSE)),\"\",VLOOKUP($AB7&$Z$3&AE$4,【進行】結果入力表!$Q$7:$V$150,2,FALSE))","v":45},null,{"$f":"IF(ISERROR(VLOOKUP($AB7&$Z$3&AG$4,【進行】結果入力表!$Q$7:$V$150,2,FALSE)),\"\",VLOOKUP($AB7&$Z$3&AG$4,【進行】結果入力表!$Q$7:$V$150,2,FALSE))","v":16},null,null,null,{"$f":"IF(AI5=\"\",\"\",COUNTIF(AE7:AJ7,\"w\"))","v":0},{"$f":"IF(AI5=\"\",\"\",COUNT(AE7,AG7))","v":2},{"$f":"SUM(AE7:AJ7)+AK7*AD7","v":61},null,{"$f":"IF(AI5=\"\",\"\",AM7/AD7*180)","v":61},{"$f":"IF(AI5=\"w\",180,AI5/AD7*180)+IF(AI6=\"w\",180,AI6/AD7*180)","v":360},{"$f":"AK7*10000000+AO7*AK10006*10000000+AO7*1000-AP7","v":60640},{"$f":"IF(AI5=\"\",\"\",RANK(AQ5:AQ7,AQ5:AQ7,0))","v":3},null,1,1,{"$f":"IF(【準備】登録!$B$13=\"\",\"\",【準備】登録!$B$13)","v":"NRC"},null,{"$f":"VLOOKUP(VALUE(AT7&AU7),【準備】登録!$AI$5:$AL$28,3,FALSE)","v":"岩本　剛"},null,{"$f":"VLOOKUP(AX7,【準備】登録!$AK$4:$AL$27,2,FALSE)","v":180},{"$f":"IF(ISERROR(VLOOKUP($AX7&$AV$3&BA$4,【進行】結果入力表!$Q$7:$V$150,2,FALSE)),\"\",VLOOKUP($AX7&$AV$3&BA$4,【進行】結果入力表!$Q$7:$V$150,2,FALSE))","v":"W"},null,{"$f":"IF(ISERROR(VLOOKUP($AX7&$AV$3&BC$4,【進行】結果入力表!$Q$7:$V$150,2,FALSE)),\"\",VLOOKUP($AX7&$AV$3&BC$4,【進行】結果入力表!$Q$7:$V$150,2,FALSE))","v":"W"},null,null,null,{"$f":"IF(BE5=\"\",\"\",COUNTIF(BA7:BF7,\"w\"))","v":2},{"$f":"IF(BE5=\"\",\"\",COUNT(BA7,BC7))","v":0},{"$f":"SUM(BA7:BF7)+BG7*AZ7","v":360},null,{"$f":"IF(BE5=\"\",\"\",BI7/AZ7*180)","v":360},{"$f":"IF(BE5=\"w\",180,BE5/AZ7*180)+IF(BE6=\"w\",180,BE6/AZ7*180)","v":132},{"$f":"BG7*10000000+BK7*BG10006*10000000+BK7*1000-BL7","v":20359868},{"$f":"IF(BE5=\"\",\"\",RANK(BM5:BM7,BM5:BM7,0))","v":1}]
[]
[null,null,null,2,null,"Name",null,{"$f":"$H$4","v":"持点"},{"$f":"$D$5","v":"SBC"},null,{"$f":"$D$6","v":"HRC"},null,{"$f":"$D$7","v":"NRC"},null,"W","L","TP",null,"TP","LP","R_P","R",null,null,null,2,null,"Name",null,{"$f":"$H$4","v":"持点"},{"$f":"$D$5","v":"SBC"},null,{"$f":"$D$6","v":"HRC"},null,{"$f":"$D$7","v":"NRC"},null,"W","L","TP",null,"TP","LP","R_P","R",null,null,null,2,null,"Name",null,{"$f":"$H$4","v":"持点"},{"$f":"$D$5","v":"SBC"},null,{"$f":"$D$6","v":"HRC"},null,{"$f":"$D$7","v":"NRC"},null,"W","L","TP",null,"TP","LP","R_P","R"]
[3,2,null,{"$f":"$D$5","v":"SBC"},null,{"$f":"VLOOKUP(VALUE($A10&$D9),【準備】登録!$AI$5:$AL$28,3,FALSE)","v":"秋田　倫央"},null,{"$f":"VLOOKUP(F10,【準備】登録!$AK$4:$AL$27,2,FALSE)","v":180},null,null,{"$f":"IF(ISERROR(VLOOKUP($F10&$D$3&K$4,【進行】結果入力表!$Q$7:$V$150,2,FALSE)),\"\",VLOOKUP($F10&$D$3&K$4,【進行】結果入力表!$Q$7:$V$150,2,FALSE))","v":60},null,{"$f":"IF(ISERROR(VLOOKUP($F10&$D$3&M$4,【進行】結果入力表!$Q$7:$V$150,2,FALSE)),\"\",VLOOKUP($F10&$D$3&M$4,【進行】結果入力表!$Q$7:$V$150,2,FALSE))","v":46},null,{"$f":"IF(M10=\"\",\"\",COUNTIF(I10:N10,\"w\"))","v":0},{"$f":"IF(M10=\"\",\"\",COUNT(K10,M10))","v":2},{"$f":"SUM(I10:N10)+O10*H10","v":106},null,{"$f":"IF(M10=\"\",\"\",Q10/H10*180)","v":106},{"$f":"IF(I11=\"w\",180,I11/H10*180)+IF(I12=\"w\",180,I12/H10*180)","v":360},{"$f":"O10*10000000+S10*O10009*10000000+S10*1000-T10","v":105640},{"$f":"IF(M10=\"\",\"\",RANK(U10:U12,U10:U12,0))","v":3},null,3,4,{"$f":"$D$5","v":"SBC"},null,{"$f":"VLOOKUP(VALUE(X10&Y10),【準備】登録!$AI$5:$AL$28,3,FALSE)","v":"大橋　義治"},null,{"$f":"VLOOKUP(AB10,【準備】登録!$AK$4:$AL$27,2,FALSE)","v":180},null,null,{"$f":"IF(ISERROR(VLOOKUP($AB10&$Z$3&AG$4,【進行】結果入力表!$Q$7:$V$150,2,FALSE)),\"\",VLOOKUP($AB10&$Z$3&AG$4,【進行】結果入力表!$Q$7:$V$150,2,FALSE))","v":"W"},null,{"$f":"IF(ISERROR(VLOOKUP($AB10&$Z$3&AI$4,【進行】結果入力表!$Q$7:$V$150,2,FALSE)),\"\",VLOOKUP($AB10&$Z$3&AI$4,【進行】結果入力表!$Q$7:$V$150,2,FALSE))","v":"W"},null,{"$f":"IF(AI10=\"\",\"\",COUNTIF(AE10:AJ10,\"w\"))","v":2},{"$f":"IF(AI10=\"\",\"\",COUNT(AG10,AI10))","v":0},{"$f":"SUM(AE10:AJ10)+AK10*AD10","v":360},null,{"$f":"IF(AI10=\"\",\"\",AM10/AD10*180)","v":360},{"$f":"IF(AE11=\"w\",180,AE11/AD10*180)+IF(AE12=\"w\",180,AE12/AD10*180)","v":290},{"$f":"AK10*10000000+AO10*AK10009*10000000+AO10*1000-AP10","v":20359710},{"$f":"IF(AI10=\"\",\"\",RANK(AQ10:AQ12,AQ10:AQ12,0))","v":1},null,3,{"$f":"IF(【準備】登録!U6=5,1,6)","v":6},{"$f":"$D$5","v":"SBC"},null,{"$f":"VLOOKUP(VALUE(AT10&AU10),【準備】登録!$AI$5:$AL$28,3,FALSE)","v":"大橋　洋子"},null,{"$f":"VLOOKUP(AX10,【準備】登録!$AK$4:$AL$27,2,FALSE)","v":140},null,null,{"$f":"IF(ISERROR(VLOOKUP($AX10&$AV$3&BC$4,【進行】結果入力表!$Q$7:$V$150,2,FALSE)),\"\",VLOOKUP($AX10&$AV$3&BC$4,【進行】結果入力表!$Q$7:$V$150,2,FALSE))","v":"W"},null,{"$f":"IF(ISERROR(VLOOKUP($AX10&$AV$3&BE$4,【進行】結果入力表!$Q$7:$V$150,2,FALSE)),\"\",VLOOKUP($AX10&$AV$3&BE$4,【進行】結果入力表!$Q$7:$V$150,2,FALSE))","v":111},null,{"$f":"IF(BE10=\"\",\"\",COUNTIF(BA10:BF10,\"w\"))","v":1},{"$f":"IF(BE10=\"\",\"\",COUNT(BC10,BE10))","v":1},{"$f":"SUM(BA10:BF10)+BG10*AZ10","v":251},null,{"$f":"IF(BE10=\"\",\"\",BI10/AZ10*180)","v":322.71428571428572},{"$f":"IF(BA11=\"w\",180,BA11/AZ10*180)+IF(BA12=\"w\",180,BA12/AZ10*180)","v":293.14285714285711},{"$f":"BG10*10000000+BK10*BG10009*10000000+BK10*1000-BL10","v":10322421.142857142},{"$f":"IF(BE10=\"\",\"\",RANK(BM10:BM12,BM10:BM12,0))","v":1}]
[2,2,null,{"$f":"$D$6","v":"HRC"},null,{"$f":"VLOOKUP(VALUE($A11&$D9),【準備】登録!$AI$5:$AL$28,3,FALSE)","v":"金井　健太郎"},null,{"$f":"VLOOKUP(F11,【準備】登録!$AK$4:$AL$27,2,FALSE)","v":180},{"$f":"IF(ISERROR(VLOOKUP($F11&$D$3&I$4,【進行】結果入力表!$Q$7:$V$150,2,FALSE)),\"\",VLOOKUP($F11&$D$3&I$4,【進行】結果入力表!$Q$7:$V$150,2,FALSE))","v":"W"},null,null,null,{"$f":"IF(ISERROR(VLOOKUP($F11&$D$3&M$4,【進行】結果入力表!$Q$7:$V$150,2,FALSE)),\"\",VLOOKUP($F11&$D$3&M$4,【進行】結果入力表!$Q$7:$V$150,2,FALSE))","v":"W"},null,{"$f":"IF(M10=\"\",\"\",COUNTIF(I11:N11,\"w\"))","v":2},{"$f":"IF(M10=\"\",\"\",COUNT(I11,M11))","v":0},{"$f":"SUM(I11:N11)+O11*H11","v":360},null,{"$f":"IF(M10=\"\",\"\",Q11/H11*180)","v":360},{"$f":"IF(K10=\"w\",180,K10/H11*180)+IF(K12=\"w\",180,K12/H11*180)","v":156},{"$f":"O11*10000000+S11*O10010*10000000+S11*1000-T11","v":20359844},{"$f":"IF(M10=\"\",\"\",RANK(U10:U12,U10:U12,0))","v":1},null,2,3,{"$f":"$D$6","v":"HRC"},null,{"$f":"VLOOKUP(VALUE(X11&Y11),【準備】登録!$AI$5:$AL$28,3,FALSE)","v":"平井　洸志"},null,{"$f":"VLOOKUP(AB11,【準備】登録!$AK$4:$AL$27,2,FALSE)","v":180},{"$f":"IF(ISERROR(VLOOKUP($AB11&$Z$3&AE$4,【進行】結果入力表!$Q$7:$V$150,2,FALSE)),\"\",VLOOKUP($AB11&$Z$3&AE$4,【進行】結果入力表!$Q$7:$V$150,2,FALSE))","v":160},null,null,null,{"$f":"IF(ISERROR(VLOOKUP($AB11&$Z$3&AI$4,【進行】結果入力表!$Q$7:$V$150,2,FALSE)),\"\",VLOOKUP($AB11&$Z$3&AI$4,【進行】結果入力表!$Q$7:$V$150,2,FALSE))","v":76},null,{"$f":"IF(AI10=\"\",\"\",COUNTIF(AE11:AJ11,\"w\"))","v":0},{"$f":"IF(AI10=\"\",\"\",COUNT(AE11,AI11))","v":2},{"$f":"SUM(AE11:AJ11)+AK11*AD11","v":236},null,{"$f":"IF(AI10=\"\",\"\",AM11/AD11*180)","v":236},{"$f":"IF(AG10=\"w\",180,AG10/AD11*180)+IF(AG12=\"w\",180,AG12/AD11*180)","v":360},{"$f":"AK11*10000000+AO11*AK10010*10000000+AO11*1000-AP11","v":235640},{"$f":"IF(AI10=\"\",\"\",RANK(AQ10:AQ12,AQ10:AQ12,0))","v":3},null,2,4,{"$f":"$D$6","v":"HRC"},null,{"$f":"VLOOKUP(VALUE(AT11&AU11),【準備】登録!$AI$5:$AL$28,3,FALSE)","v":"中尾　亮太"},null,{"$f":"VLOOKUP(AX11,【準備】登録!$AK$4:$AL$27,2,FALSE)","v":180},{"$f":"IF(ISERROR(VLOOKUP($AX11&$AV$3&BA$4,【進行】結果入力表!$Q$7:$V$150,2,FALSE)),\"\",VLOOKUP($AX11&$AV$3&BA$4,【進行】結果入力表!$Q$7:$V$150,2,FALSE))","v":88},null,null,null,{"$f":"IF(ISERROR(VLOOKUP($AX11&$AV$3&BE$4,【進行】結果入力表!$Q$7:$V$150,2,FALSE)),\"\",VLOOKUP($AX11&$AV$3&BE$4,【進行】結果入力表!$Q$7:$V$150,2,FALSE))","v":"W"},null,{"$f":"IF(BE10=\"\",\"\",COUNTIF(BA11:BF11,\"w\"))","v":1},{"$f":"IF(BE10=\"\",\"\",COUNT(BA11,BE11))","v":1},{"$f":"SUM(BA11:BF11)+BG11*AZ11","v":268},null,{"$f":"IF(BE10=\"\",\"\",BI11/AZ11*180)","v":268},{"$f":"IF(BC10=\"w\",180,BC10/AZ11*180)+IF(BC12=\"w\",180,BC12/AZ11*180)","v":268},{"$f":"BG11*10000000+BK11*BG10010*10000000+BK11*1000-BL11","v":10267732},{"$f":"IF(BE10=\"\",\"\",RANK(BM10:BM12,BM10:BM12,0))","v":2}]
[1,2,null,{"$f":"$D$7","v":"NRC"},null,{"$f":"VLOOKUP(VALUE($A12&$D9),【準備】登録!$AI$5:$AL$28,3,FALSE)","v":"吉向　翔平"},null,{"$f":"VLOOKUP(F12,【準備】登録!$AK$4:$AL$27,2,FALSE)","v":180},{"$f":"IF(ISERROR(VLOOKUP($F12&$D$3&I$4,【進行】結果入力表!$Q$7:$V$150,2,FALSE)),\"\",VLOOKUP($F12&$D$3&I$4,【進行】結果入力表!$Q$7:$V$150,2,FALSE))","v":"W"},null,{"$f":"IF(ISERROR(VLOOKUP($F12&$D$3&K$4,【進行】結果入力表!$Q$7:$V$150,2,FALSE)),\"\",VLOOKUP($F12&$D$3&K$4,【進行】結果入力表!$Q$7:$V$150,2,FALSE))","v":96},null,null,null,{"$f":"IF(M10=\"\",\"\",COUNTIF(I12:N12,\"w\"))","v":1},{"$f":"IF(M10=\"\",\"\",COUNT(I12,K12))","v":1},{"$f":"SUM(I12:N12)+O12*H12","v":276},null,{"$f":"IF(M10=\"\",\"\",Q12/H12*180)","v":276},{"$f":"IF(M10=\"w\",180,M10/H12*180)+IF(M11=\"w\",180,M11/H12*180)","v":226},{"$f":"O12*10000000+S12*O10011*10000000+S12*1000-T12","v":10275774},{"$f":"IF(M10=\"\",\"\",RANK(U10:U12,U10:U12,0))","v":2},null,1,2,{"$f":"$D$7","v":"NRC"},null,{"$f":"VLOOKUP(VALUE(X12&Y12),【準備】登録!$AI$5:$AL$28,3,FALSE)","v":"吉向　翔平"},null,{"$f":"VLOOKUP(AB12,【準備】登録!$AK$4:$AL$27,2,FALSE)","v":180},{"$f":"IF(ISERROR(VLOOKUP($AB12&$Z$3&AE$4,【進行】結果入力表!$Q$7:$V$150,2,FALSE)),\"\",VLOOKUP($AB12&$Z$3&AE$4,【進行】結果入力表!$Q$7:$V$150,2,FALSE))","v":130},null,{"$f":"IF(ISERROR(VLOOKUP($AB12&$Z$3&AG$4,【進行】結果入力表!$Q$7:$V$150,2,FALSE)),\"\",VLOOKUP($AB12&$Z$3&AG$4,【進行】結果入力表!$Q$7:$V$150,2,FALSE))","v":"W"},null,null,null,{"$f":"IF(AI10=\"\",\"\",COUNTIF(AE12:AJ12,\"w\"))","v":1},{"$f":"IF(AI10=\"\",\"\",COUNT(AE12,AG12))","v":1},{"$f":"SUM(AE12:AJ12)+AK12*AD12","v":310},null,{"$f":"IF(AI10=\"\",\"\",AM12/AD12*180)","v":310},{"$f":"IF(AI10=\"w\",180,AI10/AD12*180)+IF(AI11=\"w\",180,AI11/AD12*180)","v":256},{"$f":"AK12*10000000+AO12*AK10011*10000000+AO12*1000-AP12","v":10309744},{"$f":"IF(AI10=\"\",\"\",RANK(AQ10:AQ12,AQ10:AQ12,0))","v":2},null,1,2,{"$f":"$D$7","v":"NRC"},null,{"$f":"VLOOKUP(VALUE(AT12&AU12),【準備】登録!$AI$5:$AL$28,3,FALSE)","v":"吉向　翔平"},null,{"$f":"VLOOKUP(AX12,【準備】登録!$AK$4:$AL$27,2,FALSE)","v":180},{"$f":"IF(ISERROR(VLOOKUP($AX12&$AV$3&BA$4,【進行】結果入力表!$Q$7:$V$150,2,FALSE)),\"\",VLOOKUP($AX12&$AV$3&BA$4,【進行】結果入力表!$Q$7:$V$150,2,FALSE))","v":"W"},null,{"$f":"IF(ISERROR(VLOOKUP($AX12&$AV$3&BC$4,【進行】結果入力表!$Q$7:$V$150,2,FALSE)),\"\",VLOOKUP($AX12&$AV$3&BC$4,【進行】結果入力表!$Q$7:$V$150,2,FALSE))","v":88},null,null,null,{"$f":"IF(BE10=\"\",\"\",COUNTIF(BA12:BF12,\"w\"))","v":1},{"$f":"IF(BE10=\"\",\"\",COUNT(BA12,BC12))","v":1},{"$f":"SUM(BA12:BF12)+BG12*AZ12","v":268},null,{"$f":"IF(BE10=\"\",\"\",BI12/AZ12*180)","v":268},{"$f":"IF(BE10=\"w\",180,BE10/AZ12*180)+IF(BE11=\"w\",180,BE11/AZ12*180)","v":291},{"$f":"BG12*10000000+BK12*BG10011*10000000+BK12*1000-BL12","v":10267709},{"$f":"IF(BE10=\"\",\"\",RANK(BM10:BM12,BM10:BM12,0))","v":3}]
[]
[null,null,null,3,null,"Name",null,{"$f":"H$4","v":"持点"},{"$f":"$D$5","v":"SBC"},null,{"$f":"$D$6","v":"HRC"},null,{"$f":"$D$7","v":"NRC"},null,"W","L","TP",null,"TP","LP","R_P","R",null,null,null,3,null,"Name",null,{"$f":"$H$4","v":"持点"},{"$f":"$D$5","v":"SBC"},null,{"$f":"$D$6","v":"HRC"},null,{"$f":"$D$7","v":"NRC"},null,"W","L","TP",null,"TP","LP","R_P","R",null,null,null,3,null,"Name",null,{"$f":"$H$4","v":"持点"},{"$f":"$D$5","v":"SBC"},null,{"$f":"$D$6","v":"HRC"},null,{"$f":"$D$7","v":"NRC"},null,"W","L","TP",null,"TP","LP","R_P","R"]
[3,3,null,{"$f":"$D$5","v":"SBC"},null,{"$f":"VLOOKUP(VALUE($A15&$D14),【準備】登録!$AI$5:$AL$28,3,FALSE)","v":"大橋　正寛"},null,{"$f":"VLOOKUP(F15,【準備】登録!$AK$4:$AL$27,2,FALSE)","v":180},null,null,{"$f":"IF(ISERROR(VLOOKUP($F15&$D$3&K$4,【進行】結果入力表!$Q$7:$V$150,2,FALSE)),\"\",VLOOKUP($F15&$D$3&K$4,【進行】結果入力表!$Q$7:$V$150,2,FALSE))","v":"W"},null,{"$f":"IF(ISERROR(VLOOKUP($F15&$D$3&M$4,【進行】結果入力表!$Q$7:$V$150,2,FALSE)),\"\",VLOOKUP($F15&$D$3&M$4,【進行】結果入力表!$Q$7:$V$150,2,FALSE))","v":127},null,{"$f":"IF(M15=\"\",\"\",COUNTIF(I15:N15,\"w\"))","v":1},{"$f":"IF(M15=\"\",\"\",COUNT(K15,M15))","v":1},{"$f":"SUM(I15:N15)+O15*H15","v":307},null,{"$f":"IF(M15=\"\",\"\",Q15/H15*180)","v":307},{"$f":"IF(I16=\"w\",180,I16/H15*180)+IF(I17=\"w\",180,I17/H15*180)","v":341},{"$f":"O15*10000000+S15*O10014*10000000+S15*1000-T15","v":10306659},{"$f":"IF(M15=\"\",\"\",RANK(U15:U17,U15:U17,0))","v":2},null,3,5,{"$f":"$D$5","v":"SBC"},null,{"$f":"VLOOKUP(VALUE(X15&Y15),【準備】登録!$AI$5:$AL$28,3,FALSE)","v":"山中　康寛"},null,{"$f":"VLOOKUP(AB15,【準備】登録!$AK$4:$AL$27,2,FALSE)","v":180},null,null,{"$f":"IF(ISERROR(VLOOKUP($AB15&$Z$3&AG$4,【進行】結果入力表!$Q$7:$V$150,2,FALSE)),\"\",VLOOKUP($AB15&$Z$3&AG$4,【進行】結果入力表!$Q$7:$V$150,2,FALSE))","v":"W"},null,{"$f":"IF(ISERROR(VLOOKUP($AB15&$Z$3&AI$4,【進行】結果入力表!$Q$7:$V$150,2,FALSE)),\"\",VLOOKUP($AB15&$Z$3&AI$4,【進行】結果入力表!$Q$7:$V$150,2,FALSE))","v":164},null,{"$f":"IF(AI15=\"\",\"\",COUNTIF(AE15:AJ15,\"w\"))","v":1},{"$f":"IF(AI15=\"\",\"\",COUNT(AG15,AI15))","v":1},{"$f":"SUM(AE15:AJ15)+AK15*AD15","v":344},null,{"$f":"IF(AI15=\"\",\"\",AM15/AD15*180)","v":344},{"$f":"IF(AE16=\"w\",180,AE16/AD15*180)+IF(AE17=\"w\",180,AE17/AD15*180)","v":334},{"$f":"AK15*10000000+AO15*AK10014*10000000+AO15*1000-AP15","v":10343666},{"$f":"IF(AI15=\"\",\"\",RANK(AQ15:AQ17,AQ15:AQ17,0))","v":1},null,3,{"$f":"IF(【準備】登録!U6=5,2,IF(【準備】登録!U6=6,1,7))","v":1},{"$f":"$D$5","v":"SBC"},null,{"$f":"VLOOKUP(VALUE(AT15&AU15),【準備】登録!$AI$5:$AL$28,3,FALSE)","v":"林　秀忠"},null,{"$f":"VLOOKUP(AX15,【準備】登録!$AK$4:$AL$27,2,FALSE)","v":180},null,null,{"$f":"IF(ISERROR(VLOOKUP($AX15&$AV$3&BC$4,【進行】結果入力表!$Q$7:$V$150,2,FALSE)),\"\",VLOOKUP($AX15&$AV$3&BC$4,【進行】結果入力表!$Q$7:$V$150,2,FALSE))","v":"W"},null,{"$f":"IF(ISERROR(VLOOKUP($AX15&$AV$3&BE$4,【進行】結果入力表!$Q$7:$V$150,2,FALSE)),\"\",VLOOKUP($AX15&$AV$3&BE$4,【進行】結果入力表!$Q$7:$V$150,2,FALSE))","v":"W"},null,{"$f":"IF(BE15=\"\",\"\",COUNTIF(BA15:BF15,\"w\"))","v":2},{"$f":"IF(BE15=\"\",\"\",COUNT(BC15,BE15))","v":0},{"$f":"SUM(BA15:BF15)+BG15*AZ15","v":360},null,{"$f":"IF(BE15=\"\",\"\",BI15/AZ15*180)","v":360},{"$f":"IF(BA16=\"w\",180,BA16/AZ15*180)+IF(BA17=\"w\",180,BA17/AZ15*180)","v":200},{"$f":"BG15*10000000+BK15*BG10014*10000000+BK15*1000-BL15","v":20359800},{"$f":"IF(BE15=\"\",\"\",RANK(BM15:BM17,BM15:BM17,0))","v":1}]
[2,3,null,{"$f":"$D$6","v":"HRC"},null,{"$f":"VLOOKUP(VALUE($A16&$D14),【準備】登録!$AI$5:$AL$28,3,FALSE)","v":"平井　洸志"},null,{"$f":"VLOOKUP(F16,【準備】登録!$AK$4:$AL$27,2,FALSE)","v":180},{"$f":"IF(ISERROR(VLOOKUP($F16&$D$3&I$4,【進行】結果入力表!$Q$7:$V$150,2,FALSE)),\"\",VLOOKUP($F16&$D$3&I$4,【進行】結果入力表!$Q$7:$V$150,2,FALSE))","v":161},null,null,null,{"$f":"IF(ISERROR(VLOOKUP($F16&$D$3&M$4,【進行】結果入力表!$Q$7:$V$150,2,FALSE)),\"\",VLOOKUP($F16&$D$3&M$4,【進行】結果入力表!$Q$7:$V$150,2,FALSE))","v":93},null,{"$f":"IF(M15=\"\",\"\",COUNTIF(I16:N16,\"w\"))","v":0},{"$f":"IF(M15=\"\",\"\",COUNT(I16,M16))","v":2},{"$f":"SUM(I16:N16)+O16*H16","v":254},null,{"$f":"IF(M15=\"\",\"\",Q16/H16*180)","v":254.00000000000003},{"$f":"IF(K15=\"w\",180,K15/H16*180)+IF(K17=\"w\",180,K17/H16*180)","v":360},{"$f":"O16*10000000+S16*O10015*10000000+S16*1000-T16","v":253640.00000000003},{"$f":"IF(M15=\"\",\"\",RANK(U15:U17,U15:U17,0))","v":3},null,2,4,{"$f":"$D$6","v":"HRC"},null,{"$f":"VLOOKUP(VALUE(X16&Y16),【準備】登録!$AI$5:$AL$28,3,FALSE)","v":"中尾　亮太"},null,{"$f":"VLOOKUP(AB16,【準備】登録!$AK$4:$AL$27,2,FALSE)","v":180},{"$f":"IF(ISERROR(VLOOKUP($AB16&$Z$3&AE$4,【進行】結果入力表!$Q$7:$V$150,2,FALSE)),\"\",VLOOKUP($AB16&$Z$3&AE$4,【進行】結果入力表!$Q$7:$V$150,2,FALSE))","v":154},null,null,null,{"$f":"IF(ISERROR(VLOOKUP($AB16&$Z$3&AI$4,【進行】結果入力表!$Q$7:$V$150,2,FALSE)),\"\",VLOOKUP($AB16&$Z$3&AI$4,【進行】結果入力表!$Q$7:$V$150,2,FALSE))","v":"W"},null,{"$f":"IF(AI15=\"\",\"\",COUNTIF(AE16:AJ16,\"w\"))","v":1},{"$f":"IF(AI15=\"\",\"\",COUNT(AE16,AI16))","v":1},{"$f":"SUM(AE16:AJ16)+AK16*AD16","v":334},null,{"$f":"IF(AI15=\"\",\"\",AM16/AD16*180)","v":334},{"$f":"IF(AG15=\"w\",180,AG15/AD16*180)+IF(AG17=\"w\",180,AG17/AD16*180)","v":282},{"$f":"AK16*10000000+AO16*AK10015*10000000+AO16*1000-AP16","v":10333718},{"$f":"IF(AI15=\"\",\"\",RANK(AQ15:AQ17,AQ15:AQ17,0))","v":2},null,2,5,{"$f":"$D$6","v":"HRC"},null,{"$f":"VLOOKUP(VALUE(AT16&AU16),【準備】登録!$AI$5:$AL$28,3,FALSE)","v":"宮本　一"},null,{"$f":"VLOOKUP(AX16,【準備】登録!$AK$4:$AL$27,2,FALSE)","v":180},{"$f":"IF(ISERROR(VLOOKUP($AX16&$AV$3&BA$4,【進行】結果入力表!$Q$7:$V$150,2,FALSE)),\"\",VLOOKUP($AX16&$AV$3&BA$4,【進行】結果入力表!$Q$7:$V$150,2,FALSE))","v":130},null,null,null,{"$f":"IF(ISERROR(VLOOKUP($AX16&$AV$3&BE$4,【進行】結果入力表!$Q$7:$V$150,2,FALSE)),\"\",VLOOKUP($AX16&$AV$3&BE$4,【進行】結果入力表!$Q$7:$V$150,2,FALSE))","v":"W"},null,{"$f":"IF(BE15=\"\",\"\",COUNTIF(BA16:BF16,\"w\"))","v":1},{"$f":"IF(BE15=\"\",\"\",COUNT(BA16,BE16))","v":1},{"$f":"SUM(BA16:BF16)+BG16*AZ16","v":310},null,{"$f":"IF(BE15=\"\",\"\",BI16/AZ16*180)","v":310},{"$f":"IF(BC15=\"w\",180,BC15/AZ16*180)+IF(BC17=\"w\",180,BC17/AZ16*180)","v":327},{"$f":"BG16*10000000+BK16*BG10015*10000000+BK16*1000-BL16","v":10309673},{"$f":"IF(BE15=\"\",\"\",RANK(BM15:BM17,BM15:BM17,0))","v":2}]
[1,3,null,{"$f":"$D$7","v":"NRC"},null,{"$f":"VLOOKUP(VALUE($A17&$D14),【準備】登録!$AI$5:$AL$28,3,FALSE)","v":"金澤　茂昌"},null,{"$f":"VLOOKUP(F17,【準備】登録!$AK$4:$AL$27,2,FALSE)","v":180},{"$f":"IF(ISERROR(VLOOKUP($F17&$D$3&I$4,【進行】結果入力表!$Q$7:$V$150,2,FALSE)),\"\",VLOOKUP($F17&$D$3&I$4,【進行】結果入力表!$Q$7:$V$150,2,FALSE))","v":"W"},null,{"$f":"IF(ISERROR(VLOOKUP($F17&$D$3&K$4,【進行】結果入力表!$Q$7:$V$150,2,FALSE)),\"\",VLOOKUP($F17&$D$3&K$4,【進行】結果入力表!$Q$7:$V$150,2,FALSE))","v":"W"},null,null,null,{"$f":"IF(M15=\"\",\"\",COUNTIF(I17:N17,\"w\"))","v":2},{"$f":"IF(M15=\"\",\"\",COUNT(I17,K17))","v":0},{"$f":"SUM(I17:N17)+O17*H17","v":360},null,{"$f":"IF(M15=\"\",\"\",Q17/H17*180)","v":360},{"$f":"IF(M15=\"w\",180,M15/H17*180)+IF(M16=\"w\",180,M16/H17*180)","v":220.00000000000003},{"$f":"O17*10000000+S17*O10016*10000000+S17*1000-T17","v":20359780},{"$f":"IF(M15=\"\",\"\",RANK(U15:U17,U15:U17,0))","v":1},null,1,3,{"$f":"$D$7","v":"NRC"},null,{"$f":"VLOOKUP(VALUE(X17&Y17),【準備】登録!$AI$5:$AL$28,3,FALSE)","v":"金澤　茂昌"},null,{"$f":"VLOOKUP(AB17,【準備】登録!$AK$4:$AL$27,2,FALSE)","v":180},{"$f":"IF(ISERROR(VLOOKUP($AB17&$Z$3&AE$4,【進行】結果入力表!$Q$7:$V$150,2,FALSE)),\"\",VLOOKUP($AB17&$Z$3&AE$4,【進行】結果入力表!$Q$7:$V$150,2,FALSE))","v":"W"},null,{"$f":"IF(ISERROR(VLOOKUP($AB17&$Z$3&AG$4,【進行】結果入力表!$Q$7:$V$150,2,FALSE)),\"\",VLOOKUP($AB17&$Z$3&AG$4,【進行】結果入力表!$Q$7:$V$150,2,FALSE))","v":102},null,null,null,{"$f":"IF(AI15=\"\",\"\",COUNTIF(AE17:AJ17,\"w\"))","v":1},{"$f":"IF(AI15=\"\",\"\",COUNT(AE17,AG17))","v":1},{"$f":"SUM(AE17:AJ17)+AK17*AD17","v":282},null,{"$f":"IF(AI15=\"\",\"\",AM17/AD17*180)","v":282},{"$f":"IF(AI15=\"w\",180,AI15/AD17*180)+IF(AI16=\"w\",180,AI16/AD17*180)","v":344},{"$f":"AK17*10000000+AO17*AK10016*10000000+AO17*1000-AP17","v":10281656},{"$f":"IF(AI15=\"\",\"\",RANK(AQ15:AQ17,AQ15:AQ17,0))","v":3},null,1,3,{"$f":"$D$7","v":"NRC"},null,{"$f":"VLOOKUP(VALUE(AT17&AU17),【準備】登録!$AI$5:$AL$28,3,FALSE)","v":"金澤　茂昌"},null,{"$f":"VLOOKUP(AX17,【準備】登録!$AK$4:$AL$27,2,FALSE)","v":180},{"$f":"IF(ISERROR(VLOOKUP($AX17&$AV$3&BA$4,【進行】結果入力表!$Q$7:$V$150,2,FALSE)),\"\",VLOOKUP($AX17&$AV$3&BA$4,【進行】結果入力表!$Q$7:$V$150,2,FALSE))","v":70},null,{"$f":"IF(ISERROR(VLOOKUP($AX17&$AV$3&BC$4,【進行】結果入力表!$Q$7:$V$150,2,FALSE)),\"\",VLOOKUP($AX17&$AV$3&BC$4,【進行】結果入力表!$Q$7:$V$150,2,FALSE))","v":147},null,null,null,{"$f":"IF(BE15=\"\",\"\",COUNTIF(BA17:BF17,\"w\"))","v":0},{"$f":"IF(BE15=\"\",\"\",COUNT(BA17,BC17))","v":2},{"$f":"SUM(BA17:BF17)+BG17*AZ17","v":217},null,{"$f":"IF(BE15=\"\",\"\",BI17/AZ17*180)","v":217},{"$f":"IF(BE15=\"w\",180,BE15/AZ17*180)+IF(BE16=\"w\",180,BE16/AZ17*180)","v":360},{"$f":"BG17*10000000+BK17*BG10016*10000000+BK17*1000-BL17","v":216640},{"$f":"IF(BE15=\"\",\"\",RANK(BM15:BM17,BM15:BM17,0))","v":3}]
[]
[null,null,null,4,null,"Name",null,{"$f":"H$4","v":"持点"},{"$f":"$D$5","v":"SBC"},null,{"$f":"$D$6","v":"HRC"},null,{"$f":"$D$7","v":"NRC"},null,"W","L","TP",null,"TP","LP","R_P","R",null,null,null,4,null,"Name",null,{"$f":"$H$4","v":"持点"},{"$f":"M30","v":116},null,{"$f":"$D$6","v":"HRC"},null,{"$f":"$D$7","v":"NRC"},null,"W","L","TP",null,"TP","LP","R_P","R",null,null,null,4,null,"Name",null,{"$f":"$H$4","v":"持点"},{"$f":"$D$5","v":"SBC"},null,{"$f":"$D$6","v":"HRC"},null,{"$f":"$D$7","v":"NRC"},null,"W","L","TP",null,"TP","LP","R_P","R"]
[3,4,null,{"$f":"$D$5","v":"SBC"},null,{"$f":"VLOOKUP(VALUE($A20&$D19),【準備】登録!$AI$5:$AL$28,3,FALSE)","v":"大橋　義治"},null,{"$f":"VLOOKUP(F20,【準備】登録!$AK$4:$AL$27,2,FALSE)","v":180},null,null,{"$f":"IF(ISERROR(VLOOKUP($F20&$D$3&K$4,【進行】結果入力表!$Q$7:$V$150,2,FALSE)),\"\",VLOOKUP($F20&$D$3&K$4,【進行】結果入力表!$Q$7:$V$150,2,FALSE))","v":"W"},null,{"$f":"IF(ISERROR(VLOOKUP($F20&$D$3&M$4,【進行】結果入力表!$Q$7:$V$150,2,FALSE)),\"\",VLOOKUP($F20&$D$3&M$4,【進行】結果入力表!$Q$7:$V$150,2,FALSE))","v":"W"},null,{"$f":"IF(M20=\"\",\"\",COUNTIF(I20:N20,\"w\"))","v":2},{"$f":"IF(M20=\"\",\"\",COUNT(K20,M20))","v":0},{"$f":"SUM(I20:N20)+O20*H20","v":360},null,{"$f":"IF(M20=\"\",\"\",Q20/H20*180)","v":360},{"$f":"IF(I21=\"w\",180,I21/H20*180)+IF(I22=\"w\",180,I22/H20*180)","v":206},{"$f":"O20*10000000+S20*O10019*10000000+S20*1000-T20","v":20359794},{"$f":"IF(M20=\"\",\"\",RANK(U20:U22,U20:U22,0))","v":1},null,3,{"$f":"IF(【準備】登録!U6=5,1,6)","v":6},{"$f":"$D$5","v":"SBC"},null,{"$f":"VLOOKUP(VALUE(X20&Y20),【準備】登録!$AI$5:$AL$28,3,FALSE)","v":"大橋　洋子"},null,{"$f":"VLOOKUP(AB20,【準備】登録!$AK$4:$AL$27,2,FALSE)","v":140},null,null,{"$f":"IF(ISERROR(VLOOKUP($AB20&$Z$3&AG$4,【進行】結果入力表!$Q$7:$V$150,2,FALSE)),\"\",VLOOKUP($AB20&$Z$3&AG$4,【進行】結果入力表!$Q$7:$V$150,2,FALSE))","v":59},null,{"$f":"IF(ISERROR(VLOOKUP($AB20&$Z$3&AI$4,【進行】結果入力表!$Q$7:$V$150,2,FALSE)),\"\",VLOOKUP($AB20&$Z$3&AI$4,【進行】結果入力表!$Q$7:$V$150,2,FALSE))","v":35},null,{"$f":"IF(AI20=\"\",\"\",COUNTIF(AE20:AJ20,\"w\"))","v":0},{"$f":"IF(AI20=\"\",\"\",COUNT(AG20,AI20))","v":2},{"$f":"SUM(AE20:AJ20)+AK20*AD20","v":94},null,{"$f":"IF(AI20=\"\",\"\",AM20/AD20*180)","v":120.85714285714285},{"$f":"IF(AE21=\"w\",180,AE21/AD20*180)+IF(AE22=\"w\",180,AE22/AD20*180)","v":360},{"$f":"AK20*10000000+AO20*AK10019*10000000+AO20*1000-AP20","v":120497.14285714284},{"$f":"IF(AI20=\"\",\"\",RANK(AQ20:AQ22,AQ20:AQ22,0))","v":3},null,3,2,{"$f":"$D$5","v":"SBC"},null,{"$f":"VLOOKUP(VALUE(AT20&AU20),【準備】登録!$AI$5:$AL$28,3,FALSE)","v":"秋田　倫央"},null,{"$f":"VLOOKUP(AX20,【準備】登録!$AK$4:$AL$27,2,FALSE)","v":180},null,null,{"$f":"IF(ISERROR(VLOOKUP($AX20&$AV$3&BC$4,【進行】結果入力表!$Q$7:$V$150,2,FALSE)),\"\",VLOOKUP($AX20&$AV$3&BC$4,【進行】結果入力表!$Q$7:$V$150,2,FALSE))","v":"W"},null,{"$f":"IF(ISERROR(VLOOKUP($AX20&$AV$3&BE$4,【進行】結果入力表!$Q$7:$V$150,2,FALSE)),\"\",VLOOKUP($AX20&$AV$3&BE$4,【進行】結果入力表!$Q$7:$V$150,2,FALSE))","v":168},null,{"$f":"IF(BE20=\"\",\"\",COUNTIF(BA20:BF20,\"w\"))","v":1},{"$f":"IF(BE20=\"\",\"\",COUNT(BC20,BE20))","v":1},{"$f":"SUM(BA20:BF20)+BG20*AZ20","v":348},null,{"$f":"IF(BE20=\"\",\"\",BI20/AZ20*180)","v":348},{"$f":"IF(BA21=\"w\",180,BA21/AZ20*180)+IF(BA22=\"w\",180,BA22/AZ20*180)","v":259},{"$f":"BG20*10000000+BK20*BG10019*10000000+BK20*1000-BL20","v":10347741},{"$f":"IF(BE20=\"\",\"\",RANK(BM20:BM22,BM20:BM22,0))","v":1}]
[2,4,null,{"$f":"$D$6","v":"HRC"},null,{"$f":"VLOOKUP(VALUE($A21&$D19),【準備】登録!$AI$5:$AL$28,3,FALSE)","v":"中尾　亮太"},null,{"$f":"VLOOKUP(F21,【準備】登録!$AK$4:$AL$27,2,FALSE)","v":180},{"$f":"IF(ISERROR(VLOOKUP($F21&$D$3&I$4,【進行】結果入力表!$Q$7:$V$150,2,FALSE)),\"\",VLOOKUP($F21&$D$3&I$4,【進行】結果入力表!$Q$7:$V$150,2,FALSE))","v":167},null,null,null,{"$f":"IF(ISERROR(VLOOKUP($F21&$D$3&M$4,【進行】結果入力表!$Q$7:$V$150,2,FALSE)),\"\",VLOOKUP($F21&$D$3&M$4,【進行】結果入力表!$Q$7:$V$150,2,FALSE))","v":"W"},null,{"$f":"IF(M20=\"\",\"\",COUNTIF(I21:N21,\"w\"))","v":1},{"$f":"IF(M20=\"\",\"\",COUNT(I21,M21))","v":1},{"$f":"SUM(I21:N21)+O21*H21","v":347},null,{"$f":"IF(M20=\"\",\"\",Q21/H21*180)","v":347},{"$f":"IF(K20=\"w\",180,K20/H21*180)+IF(K22=\"w\",180,K22/H21*180)","v":316},{"$f":"O21*10000000+S21*O10020*10000000+S21*1000-T21","v":10346684},{"$f":"IF(M20=\"\",\"\",RANK(U20:U22,U20:U22,0))","v":2},null,2,5,{"$f":"$D$6","v":"HRC"},null,{"$f":"VLOOKUP(VALUE(X21&Y21),【準備】登録!$AI$5:$AL$28,3,FALSE)","v":"宮本　一"},null,{"$f":"VLOOKUP(AB21,【準備】登録!$AK$4:$AL$27,2,FALSE)","v":180},{"$f":"IF(ISERROR(VLOOKUP($AB21&$Z$3&AE$4,【進行】結果入力表!$Q$7:$V$150,2,FALSE)),\"\",VLOOKUP($AB21&$Z$3&AE$4,【進行】結果入力表!$Q$7:$V$150,2,FALSE))","v":"W"},null,null,null,{"$f":"IF(ISERROR(VLOOKUP($AB21&$Z$3&AI$4,【進行】結果入力表!$Q$7:$V$150,2,FALSE)),\"\",VLOOKUP($AB21&$Z$3&AI$4,【進行】結果入力表!$Q$7:$V$150,2,FALSE))","v":"W"},null,{"$f":"IF(AI20=\"\",\"\",COUNTIF(AE21:AJ21,\"w\"))","v":2},{"$f":"IF(AI20=\"\",\"\",COUNT(AE21,AI21))","v":0},{"$f":"SUM(AE21:AJ21)+AK21*AD21","v":360},null,{"$f":"IF(AI20=\"\",\"\",AM21/AD21*180)","v":360},{"$f":"IF(AG20=\"w\",180,AG20/AD21*180)+IF(AG22=\"w\",180,AG22/AD21*180)","v":115},{"$f":"AK21*10000000+AO21*AK10020*10000000+AO21*1000-AP21","v":20359885},{"$f":"IF(AI20=\"\",\"\",RANK(AQ20:AQ22,AQ20:AQ22,0))","v":1},null,2,6,{"$f":"$D$6","v":"HRC"},null,{"$f":"VLOOKUP(VALUE(AT21&AU21),【準備】登録!$AI$5:$AL$28,3,FALSE)","v":"河地　恵里"},null,{"$f":"VLOOKUP(AX21,【準備】登録!$AK$4:$AL$27,2,FALSE)","v":140},{"$f":"IF(ISERROR(VLOOKUP($AX21&$AV$3&BA$4,【進行】結果入力表!$Q$7:$V$150,2,FALSE)),\"\",VLOOKUP($AX21&$AV$3&BA$4,【進行】結果入力表!$Q$7:$V$150,2,FALSE))","v":79},null,null,null,{"$f":"IF(ISERROR(VLOOKUP($AX21&$AV$3&BE$4,【進行】結果入力表!$Q$7:$V$150,2,FALSE)),\"\",VLOOKUP($AX21&$AV$3&BE$4,【進行】結果入力表!$Q$7:$V$150,2,FALSE))","v":"W"},null,{"$f":"IF(BE20=\"\",\"\",COUNTIF(BA21:BF21,\"w\"))","v":1},{"$f":"IF(BE20=\"\",\"\",COUNT(BA21,BE21))","v":1},{"$f":"SUM(BA21:BF21)+BG21*AZ21","v":219},null,{"$f":"IF(BE20=\"\",\"\",BI21/AZ21*180)","v":281.57142857142856},{"$f":"IF(BC20=\"w\",180,BC20/AZ21*180)+IF(BC22=\"w\",180,BC22/AZ21*180)","v":286.71428571428572},{"$f":"BG21*10000000+BK21*BG10020*10000000+BK21*1000-BL21","v":10281284.714285715},{"$f":"IF(BE20=\"\",\"\",RANK(BM20:BM22,BM20:BM22,0))","v":2}]
[1,4,null,{"$f":"$D$7","v":"NRC"},null,{"$f":"VLOOKUP(VALUE($A22&$D19),【準備】登録!$AI$5:$AL$28,3,FALSE)","v":"植田　慎也"},null,{"$f":"VLOOKUP(F22,【準備】登録!$AK$4:$AL$27,2,FALSE)","v":180},{"$f":"IF(ISERROR(VLOOKUP($F22&$D$3&I$4,【進行】結果入力表!$Q$7:$V$150,2,FALSE)),\"\",VLOOKUP($F22&$D$3&I$4,【進行】結果入力表!$Q$7:$V$150,2,FALSE))","v":39},null,{"$f":"IF(ISERROR(VLOOKUP($F22&$D$3&K$4,【進行】結果入力表!$Q$7:$V$150,2,FALSE)),\"\",VLOOKUP($F22&$D$3&K$4,【進行】結果入力表!$Q$7:$V$150,2,FALSE))","v":136},null,null,null,{"$f":"IF(M20=\"\",\"\",COUNTIF(I22:N22,\"w\"))","v":0},{"$f":"IF(M20=\"\",\"\",COUNT(I22,K22))","v":2},{"$f":"SUM(I22:N22)+O22*H22","v":175},null,{"$f":"IF(M20=\"\",\"\",Q22/H22*180)","v":175},{"$f":"IF(M20=\"w\",180,M20/H22*180)+IF(M21=\"w\",180,M21/H22*180)","v":360},{"$f":"O22*10000000+S22*O10021*10000000+S22*1000-T22","v":174640},{"$f":"IF(M20=\"\",\"\",RANK(U20:U22,U20:U22,0))","v":3},null,1,4,{"$f":"$D$7","v":"NRC"},null,{"$f":"VLOOKUP(VALUE(X22&Y22),【準備】登録!$AI$5:$AL$28,3,FALSE)","v":"植田　慎也"},null,{"$f":"VLOOKUP(AB22,【準備】登録!$AK$4:$AL$27,2,FALSE)","v":180},{"$f":"IF(ISERROR(VLOOKUP($AB22&$Z$3&AE$4,【進行】結果入力表!$Q$7:$V$150,2,FALSE)),\"\",VLOOKUP($AB22&$Z$3&AE$4,【進行】結果入力表!$Q$7:$V$150,2,FALSE))","v":"W"},null,{"$f":"IF(ISERROR(VLOOKUP($AB22&$Z$3&AG$4,【進行】結果入力表!$Q$7:$V$150,2,FALSE)),\"\",VLOOKUP($AB22&$Z$3&AG$4,【進行】結果入力表!$Q$7:$V$150,2,FALSE))","v":56},null,null,null,{"$f":"IF(AI20=\"\",\"\",COUNTIF(AE22:AJ22,\"w\"))","v":1},{"$f":"IF(AI20=\"\",\"\",COUNT(AE22,AG22))","v":1},{"$f":"SUM(AE22:AJ22)+AK22*AD22","v":236},null,{"$f":"IF(AI20=\"\",\"\",AM22/AD22*180)","v":236},{"$f":"IF(AI20=\"w\",180,AI20/AD22*180)+IF(AI21=\"w\",180,AI21/AD22*180)","v":215},{"$f":"AK22*10000000+AO22*AK10021*10000000+AO22*1000-AP22","v":10235785},{"$f":"IF(AI20=\"\",\"\",RANK(AQ20:AQ22,AQ20:AQ22,0))","v":2},null,1,4,{"$f":"$D$7","v":"NRC"},null,{"$f":"VLOOKUP(VALUE(AT22&AU22),【準備】登録!$AI$5:$AL$28,3,FALSE)","v":"植田　慎也"},null,{"$f":"VLOOKUP(AX22,【準備】登録!$AK$4:$AL$27,2,FALSE)","v":180},{"$f":"IF(ISERROR(VLOOKUP($AX22&$AV$3&BA$4,【進行】結果入力表!$Q$7:$V$150,2,FALSE)),\"\",VLOOKUP($AX22&$AV$3&BA$4,【進行】結果入力表!$Q$7:$V$150,2,FALSE))","v":"W"},null,{"$f":"IF(ISERROR(VLOOKUP($AX22&$AV$3&BC$4,【進行】結果入力表!$Q$7:$V$150,2,FALSE)),\"\",VLOOKUP($AX22&$AV$3&BC$4,【進行】結果入力表!$Q$7:$V$150,2,FALSE))","v":83},null,null,null,{"$f":"IF(BE20=\"\",\"\",COUNTIF(BA22:BF22,\"w\"))","v":1},{"$f":"IF(BE20=\"\",\"\",COUNT(BA22,BC22))","v":1},{"$f":"SUM(BA22:BF22)+BG22*AZ22","v":263},null,{"$f":"IF(BE20=\"\",\"\",BI22/AZ22*180)","v":263},{"$f":"IF(BE20=\"w\",180,BE20/AZ22*180)+IF(BE21=\"w\",180,BE21/AZ22*180)","v":348},{"$f":"BG22*10000000+BK22*BG10021*10000000+BK22*1000-BL22","v":10262652},{"$f":"IF(BE20=\"\",\"\",RANK(BM20:BM22,BM20:BM22,0))","v":3}]
[]
[null,null,null,5,null,"Name",null,{"$f":"H$4","v":"持点"},{"$f":"$D$5","v":"SBC"},null,{"$f":"$D$6","v":"HRC"},null,{"$f":"$D$7","v":"NRC"},null,"W","L","TP",null,"TP","LP","R_P","R",null,null,null,5,null,"Name",null,{"$f":"$H$4","v":"持点"},{"$f":"$D$5","v":"SBC"},null,{"$f":"$D$6","v":"HRC"},null,{"$f":"$D$7","v":"NRC"},null,"W","L","TP",null,"TP","LP","R_P","R",null,null,null,5,null,"Name",null,{"$f":"$H$4","v":"持点"},{"$f":"$D$5","v":"SBC"},null,{"$f":"$D$6","v":"HRC"},null,{"$f":"$D$7","v":"NRC"},null,"W","L","TP",null,"TP","LP","R_P","R"]
[3,5,null,{"$f":"$D$5","v":"SBC"},null,{"$f":"VLOOKUP(VALUE($A25&$D24),【準備】登録!$AI$5:$AL$28,3,FALSE)","v":"山中　康寛"},null,{"$f":"VLOOKUP(F25,【準備】登録!$AK$4:$AL$27,2,FALSE)","v":180},null,null,{"$f":"IF(ISERROR(VLOOKUP($F25&$D$3&K$4,【進行】結果入力表!$Q$7:$V$150,2,FALSE)),\"\",VLOOKUP($F25&$D$3&K$4,【進行】結果入力表!$Q$7:$V$150,2,FALSE))","v":92},null,{"$f":"IF(ISERROR(VLOOKUP($F25&$D$3&M$4,【進行】結果入力表!$Q$7:$V$150,2,FALSE)),\"\",VLOOKUP($F25&$D$3&M$4,【進行】結果入力表!$Q$7:$V$150,2,FALSE))","v":"W"},null,{"$f":"IF(M25=\"\",\"\",COUNTIF(I25:N25,\"w\"))","v":1},{"$f":"IF(M25=\"\",\"\",COUNT(K25,M25))","v":1},{"$f":"SUM(I25:N25)+O25*H25","v":272},null,{"$f":"IF(M25=\"\",\"\",Q25/H25*180)","v":272},{"$f":"IF(I26=\"w\",180,I26/H25*180)+IF(I27=\"w\",180,I27/H25*180)","v":333},{"$f":"O25*10000000+S25*O10024*10000000+S25*1000-T25","v":10271667},{"$f":"IF(M25=\"\",\"\",RANK(U25:U27,U25:U27,0))","v":2},null,3,{"$f":"IF(【準備】登録!U6=5,2,IF(【準備】登録!U6=6,1,7))","v":1},{"$f":"$D$5","v":"SBC"},null,{"$f":"VLOOKUP(VALUE(X25&Y25),【準備】登録!$AI$5:$AL$28,3,FALSE)","v":"林　秀忠"},null,{"$f":"VLOOKUP(AB25,【準備】登録!$AK$4:$AL$27,2,FALSE)","v":180},null,null,{"$f":"IF(ISERROR(VLOOKUP($AB25&$Z$3&AG$4,【進行】結果入力表!$Q$7:$V$150,2,FALSE)),\"\",VLOOKUP($AB25&$Z$3&AG$4,【進行】結果入力表!$Q$7:$V$150,2,FALSE))","v":154},null,{"$f":"IF(ISERROR(VLOOKUP($AB25&$Z$3&AI$4,【進行】結果入力表!$Q$7:$V$150,2,FALSE)),\"\",VLOOKUP($AB25&$Z$3&AI$4,【進行】結果入力表!$Q$7:$V$150,2,FALSE))","v":"W"},null,{"$f":"IF(AI25=\"\",\"\",COUNTIF(AE25:AJ25,\"w\"))","v":1},{"$f":"IF(AI25=\"\",\"\",COUNT(AG25,AI25))","v":1},{"$f":"SUM(AE25:AJ25)+AK25*AD25","v":334},null,{"$f":"IF(AI25=\"\",\"\",AM25/AD25*180)","v":334},{"$f":"IF(AE26=\"w\",180,AE26/AD25*180)+IF(AE27=\"w\",180,AE27/AD25*180)","v":225},{"$f":"AK25*10000000+AO25*AK10024*10000000+AO25*1000-AP25","v":10333775},{"$f":"IF(AI25=\"\",\"\",RANK(AQ25:AQ27,AQ25:AQ27,0))","v":2},null,3,3,{"$f":"$D$5","v":"SBC"},null,{"$f":"VLOOKUP(VALUE(AT25&AU25),【準備】登録!$AI$5:$AL$28,3,FALSE)","v":"大橋　正寛"},null,{"$f":"VLOOKUP(AX25,【準備】登録!$AK$4:$AL$27,2,FALSE)","v":180},null,null,{"$f":"IF(ISERROR(VLOOKUP($AX25&$AV$3&BC$4,【進行】結果入力表!$Q$7:$V$150,2,FALSE)),\"\",VLOOKUP($AX25&$AV$3&BC$4,【進行】結果入力表!$Q$7:$V$150,2,FALSE))","v":"W"},null,{"$f":"IF(ISERROR(VLOOKUP($AX25&$AV$3&BE$4,【進行】結果入力表!$Q$7:$V$150,2,FALSE)),\"\",VLOOKUP($AX25&$AV$3&BE$4,【進行】結果入力表!$Q$7:$V$150,2,FALSE))","v":"W"},null,{"$f":"IF(BE25=\"\",\"\",COUNTIF(BA25:BF25,\"w\"))","v":2},{"$f":"IF(BE25=\"\",\"\",COUNT(BC25,BE25))","v":0},{"$f":"SUM(BA25:BF25)+BG25*AZ25","v":360},null,{"$f":"IF(BE25=\"\",\"\",BI25/AZ25*180)","v":360},{"$f":"IF(BA26=\"w\",180,BA26/AZ25*180)+IF(BA27=\"w\",180,BA27/AZ25*180)","v":160},{"$f":"BG25*10000000+BK25*BG10024*10000000+BK25*1000-BL25","v":20359840},{"$f":"IF(BE25=\"\",\"\",RANK(BM25:BM27,BM25:BM27,0))","v":1}]
[2,5,null,{"$f":"$D$6","v":"HRC"},null,{"$f":"VLOOKUP(VALUE($A26&$D24),【準備】登録!$AI$5:$AL$28,3,FALSE)","v":"宮本　一"},null,{"$f":"VLOOKUP(F26,【準備】登録!$AK$4:$AL$27,2,FALSE)","v":180},{"$f":"IF(ISERROR(VLOOKUP($F26&$D$3&I$4,【進行】結果入力表!$Q$7:$V$150,2,FALSE)),\"\",VLOOKUP($F26&$D$3&I$4,【進行】結果入力表!$Q$7:$V$150,2,FALSE))","v":"W"},null,null,null,{"$f":"IF(ISERROR(VLOOKUP($F26&$D$3&M$4,【進行】結果入力表!$Q$7:$V$150,2,FALSE)),\"\",VLOOKUP($F26&$D$3&M$4,【進行】結果入力表!$Q$7:$V$150,2,FALSE))","v":"W"},null,{"$f":"IF(M25=\"\",\"\",COUNTIF(I26:N26,\"w\"))","v":2},{"$f":"IF(M25=\"\",\"\",COUNT(I26,M26))","v":0},{"$f":"SUM(I26:N26)+O26*H26","v":360},null,{"$f":"IF(M25=\"\",\"\",Q26/H26*180)","v":360},{"$f":"IF(K25=\"w\",180,K25/H26*180)+IF(K27=\"w\",180,K27/H26*180)","v":132},{"$f":"O26*10000000+S26*O10025*10000000+S26*1000-T26","v":20359868},{"$f":"IF(M25=\"\",\"\",RANK(U25:U27,U25:U27,0))","v":1},null,2,{"$f":"IF(【準備】登録!U6=5,1,6)","v":6},{"$f":"$D$6","v":"HRC"},null,{"$f":"VLOOKUP(VALUE(X26&Y26),【準備】登録!$AI$5:$AL$28,3,FALSE)","v":"河地　恵里"},null,{"$f":"VLOOKUP(AB26,【準備】登録!$AK$4:$AL$27,2,FALSE)","v":140},{"$f":"IF(ISERROR(VLOOKUP($AB26&$Z$3&AE$4,【進行】結果入力表!$Q$7:$V$150,2,FALSE)),\"\",VLOOKUP($AB26&$Z$3&AE$4,【進行】結果入力表!$Q$7:$V$150,2,FALSE))","v":"W"},null,null,null,{"$f":"IF(ISERROR(VLOOKUP($AB26&$Z$3&AI$4,【進行】結果入力表!$Q$7:$V$150,2,FALSE)),\"\",VLOOKUP($AB26&$Z$3&AI$4,【進行】結果入力表!$Q$7:$V$150,2,FALSE))","v":"W"},null,{"$f":"IF(AI25=\"\",\"\",COUNTIF(AE26:AJ26,\"w\"))","v":2},{"$f":"IF(AI25=\"\",\"\",COUNT(AE26,AI26))","v":0},{"$f":"SUM(AE26:AJ26)+AK26*AD26","v":280},null,{"$f":"IF(AI25=\"\",\"\",AM26/AD26*180)","v":360},{"$f":"IF(AG25=\"w\",180,AG25/AD26*180)+IF(AG27=\"w\",180,AG27/AD26*180)","v":339.42857142857144},{"$f":"AK26*10000000+AO26*AK10025*10000000+AO26*1000-AP26","v":20359660.571428571},{"$f":"IF(AI25=\"\",\"\",RANK(AQ25:AQ27,AQ25:AQ27,0))","v":1},null,2,1,{"$f":"$D$6","v":"HRC"},null,{"$f":"VLOOKUP(VALUE(AT26&AU26),【準備】登録!$AI$5:$AL$28,3,FALSE)","v":"高木　俊行"},null,{"$f":"VLOOKUP(AX26,【準備】登録!$AK$4:$AL$27,2,FALSE)","v":180},{"$f":"IF(ISERROR(VLOOKUP($AX26&$AV$3&BA$4,【進行】結果入力表!$Q$7:$V$150,2,FALSE)),\"\",VLOOKUP($AX26&$AV$3&BA$4,【進行】結果入力表!$Q$7:$V$150,2,FALSE))","v":47},null,null,null,{"$f":"IF(ISERROR(VLOOKUP($AX26&$AV$3&BE$4,【進行】結果入力表!$Q$7:$V$150,2,FALSE)),\"\",VLOOKUP($AX26&$AV$3&BE$4,【進行】結果入力表!$Q$7:$V$150,2,FALSE))","v":"W"},null,{"$f":"IF(BE25=\"\",\"\",COUNTIF(BA26:BF26,\"w\"))","v":1},{"$f":"IF(BE25=\"\",\"\",COUNT(BA26,BE26))","v":1},{"$f":"SUM(BA26:BF26)+BG26*AZ26","v":227},null,{"$f":"IF(BE25=\"\",\"\",BI26/AZ26*180)","v":227},{"$f":"IF(BC25=\"w\",180,BC25/AZ26*180)+IF(BC27=\"w\",180,BC27/AZ26*180)","v":298},{"$f":"BG26*10000000+BK26*BG10025*10000000+BK26*1000-BL26","v":10226702},{"$f":"IF(BE25=\"\",\"\",RANK(BM25:BM27,BM25:BM27,0))","v":2}]
[1,5,null,{"$f":"$D$7","v":"NRC"},null,{"$f":"VLOOKUP(VALUE($A27&$D24),【準備】登録!$AI$5:$AL$28,3,FALSE)","v":"長谷川　進"},null,{"$f":"VLOOKUP(F27,【準備】登録!$AK$4:$AL$27,2,FALSE)","v":180},{"$f":"IF(ISERROR(VLOOKUP($F27&$D$3&I$4,【進行】結果入力表!$Q$7:$V$150,2,FALSE)),\"\",VLOOKUP($F27&$D$3&I$4,【進行】結果入力表!$Q$7:$V$150,2,FALSE))","v":153},null,{"$f":"IF(ISERROR(VLOOKUP($F27&$D$3&K$4,【進行】結果入力表!$Q$7:$V$150,2,FALSE)),\"\",VLOOKUP($F27&$D$3&K$4,【進行】結果入力表!$Q$7:$V$150,2,FALSE))","v":40},null,null,null,{"$f":"IF(M25=\"\",\"\",COUNTIF(I27:N27,\"w\"))","v":0},{"$f":"IF(M25=\"\",\"\",COUNT(I27,K27))","v":2},{"$f":"SUM(I27:N27)+O27*H27","v":193},null,{"$f":"IF(M25=\"\",\"\",Q27/H27*180)","v":193},{"$f":"IF(M25=\"w\",180,M25/H27*180)+IF(M26=\"w\",180,M26/H27*180)","v":360},{"$f":"O27*10000000+S27*O10026*10000000+S27*1000-T27","v":192640},{"$f":"IF(M25=\"\",\"\",RANK(U25:U27,U25:U27,0))","v":3},null,1,5,{"$f":"$D$7","v":"NRC"},null,{"$f":"VLOOKUP(VALUE(X27&Y27),【準備】登録!$AI$5:$AL$28,3,FALSE)","v":"長谷川　進"},null,{"$f":"VLOOKUP(AB27,【準備】登録!$AK$4:$AL$27,2,FALSE)","v":180},{"$f":"IF(ISERROR(VLOOKUP($AB27&$Z$3&AE$4,【進行】結果入力表!$Q$7:$V$150,2,FALSE)),\"\",VLOOKUP($AB27&$Z$3&AE$4,【進行】結果入力表!$Q$7:$V$150,2,FALSE))","v":45},null,{"$f":"IF(ISERROR(VLOOKUP($AB27&$Z$3&AG$4,【進行】結果入力表!$Q$7:$V$150,2,FALSE)),\"\",VLOOKUP($AB27&$Z$3&AG$4,【進行】結果入力表!$Q$7:$V$150,2,FALSE))","v":110},null,null,null,{"$f":"IF(AI25=\"\",\"\",COUNTIF(AE27:AJ27,\"w\"))","v":0},{"$f":"IF(AI25=\"\",\"\",COUNT(AE27,AG27))","v":2},{"$f":"SUM(AE27:AJ27)+AK27*AD27","v":155},null,{"$f":"IF(AI25=\"\",\"\",AM27/AD27*180)","v":155},{"$f":"IF(AI25=\"w\",180,AI25/AD27*180)+IF(AI26=\"w\",180,AI26/AD27*180)","v":360},{"$f":"AK27*10000000+AO27*AK10026*10000000+AO27*1000-AP27","v":154640},{"$f":"IF(AI25=\"\",\"\",RANK(AQ25:AQ27,AQ25:AQ27,0))","v":3},null,1,5,{"$f":"$D$7","v":"NRC"},null,{"$f":"VLOOKUP(VALUE(AT27&AU27),【準備】登録!$AI$5:$AL$28,3,FALSE)","v":"長谷川　進"},null,{"$f":"VLOOKUP(AX27,【準備】登録!$AK$4:$AL$27,2,FALSE)","v":180},{"$f":"IF(ISERROR(VLOOKUP($AX27&$AV$3&BA$4,【進行】結果入力表!$Q$7:$V$150,2,FALSE)),\"\",VLOOKUP($AX27&$AV$3&BA$4,【進行】結果入力表!$Q$7:$V$150,2,FALSE))","v":113},null,{"$f":"IF(ISERROR(VLOOKUP($AX27&$AV$3&BC$4,【進行】結果入力表!$Q$7:$V$150,2,FALSE)),\"\",VLOOKUP($AX27&$AV$3&BC$4,【進行】結果入力表!$Q$7:$V$150,2,FALSE))","v":118},null,null,null,{"$f":"IF(BE25=\"\",\"\",COUNTIF(BA27:BF27,\"w\"))","v":0},{"$f":"IF(BE25=\"\",\"\",COUNT(BA27,BC27))","v":2},{"$f":"SUM(BA27:BF27)+BG27*AZ27","v":231},null,{"$f":"IF(BE25=\"\",\"\",BI27/AZ27*180)","v":231.00000000000003},{"$f":"IF(BE25=\"w\",180,BE25/AZ27*180)+IF(BE26=\"w\",180,BE26/AZ27*180)","v":360},{"$f":"BG27*10000000+BK27*BG10026*10000000+BK27*1000-BL27","v":230640.00000000003},{"$f":"IF(BE25=\"\",\"\",RANK(BM25:BM27,BM25:BM27,0))","v":3}]
[]
[null,null,null,6,null,"Name",null,{"$f":"H$4","v":"持点"},{"$f":"$D$5","v":"SBC"},null,{"$f":"$D$6","v":"HRC"},null,{"$f":"$D$7","v":"NRC"},null,"W","L","TP",null,"TP","LP","R_P","R",null,null,null,6,null,"Name",null,{"$f":"$H$4","v":"持点"},{"$f":"$D$5","v":"SBC"},null,{"$f":"$D$6","v":"HRC"},null,{"$f":"$D$7","v":"NRC"},null,"W","L","TP",null,"TP","LP","R_P","R",null,null,null,6,null,"Name",null,{"$f":"$H$4","v":"持点"},{"$f":"$D$5","v":"SBC"},null,{"$f":"$D$6","v":"HRC"},null,{"$f":"$D$7","v":"NRC"},null,"W","L","TP",null,"TP","LP","R_P","R"]
[3,6,null,{"$f":"IF(【準備】登録!$U$6<D29,\"\",D25)","v":"SBC"},null,{"$f":"IF(VLOOKUP(VALUE($A30&$D29),【準備】登録!$AI$5:$AL$28,3,FALSE)=0,\"\",VLOOKUP(VALUE($A30&$D29),【準備】登録!$AI$5:$AL$28,3,FALSE))","v":"大橋　洋子"},null,{"$f":"VLOOKUP(F30,【準備】登録!$AK$4:$AL$27,2,FALSE)","v":140},null,null,{"$f":"IF(ISERROR(VLOOKUP($F30&$D$3&K$4,【進行】結果入力表!$Q$7:$V$150,2,FALSE)),\"\",VLOOKUP($F30&$D$3&K$4,【進行】結果入力表!$Q$7:$V$150,2,FALSE))","v":"W"},null,{"$f":"IF(ISERROR(VLOOKUP($F30&$D$3&M$4,【進行】結果入力表!$Q$7:$V$150,2,FALSE)),\"\",VLOOKUP($F30&$D$3&M$4,【進行】結果入力表!$Q$7:$V$150,2,FALSE))","v":116},null,{"$f":"IF(M30=\"\",\"\",COUNTIF(I30:N30,\"w\"))","v":1},{"$f":"IF(M30=\"\",\"\",COUNT(K30,M30))","v":1},{"$f":"SUM(I30:N30)+O30*H30","v":256},null,{"$f":"IF(M30=\"\",\"\",Q30/H30*180)","v":329.14285714285711},{"$f":"IF(I31=\"w\",180,I31/H30*180)+IF(I32=\"w\",180,I32/H30*180)","v":325.28571428571428},{"$f":"O30*10000000+S30*O10029*10000000+S30*1000-T30","v":10328817.571428571},{"$f":"IF(M30=\"\",\"\",RANK(U30:U32,U30:U32,0))","v":1},null,3,{"$f":"IF(【準備】登録!U6=5,\"\",IF(【準備】登録!U6=6,2,IF(【準備】登録!U6=7,1,IF(【準備】登録!U6=8,8))))","v":2},{"$f":"IF(【準備】登録!$U$6<Z29,\"\",Z25)","v":"SBC"},null,{"$f":"VLOOKUP(VALUE(X30&Y30),【準備】登録!$AI$5:$AL$28,3,FALSE)","v":"秋田　倫央"},null,{"$f":"VLOOKUP(AB30,【準備】登録!$AK$4:$AL$27,2,FALSE)","v":180},null,null,{"$f":"IF(ISERROR(VLOOKUP($AB30&$Z$3&AG$4,【進行】結果入力表!$Q$7:$V$150,2,FALSE)),\"\",VLOOKUP($AB30&$Z$3&AG$4,【進行】結果入力表!$Q$7:$V$150,2,FALSE))","v":"W"},null,{"$f":"IF(ISERROR(VLOOKUP($AB30&$Z$3&AI$4,【進行】結果入力表!$Q$7:$V$150,2,FALSE)),\"\",VLOOKUP($AB30&$Z$3&AI$4,【進行】結果入力表!$Q$7:$V$150,2,FALSE))","v":"W"},null,{"$f":"IF(AI30=\"\",\"\",COUNTIF(AE30:AJ30,\"w\"))","v":2},{"$f":"IF(AI30=\"\",\"\",COUNT(AG30,AI30))","v":0},{"$f":"SUM(AE30:AJ30)+AK30*AD30","v":360},null,{"$f":"IF(AI30=\"\",\"\",AM30/AD30*180)","v":360},{"$f":"IF(AE31=\"w\",180,AE31/AD30*180)+IF(AE32=\"w\",180,AE32/AD30*180)","v":230},{"$f":"AK30*10000000+AO30*AK10029*10000000+AO30*1000-AP30","v":20359770},{"$f":"IF(AI30=\"\",\"\",RANK(AQ30:AQ32,AQ30:AQ32,0))","v":1},null,3,4,{"$f":"IF(【準備】登録!$U$6<AV29,\"\",AV25)","v":"SBC"},null,{"$f":"VLOOKUP(VALUE(AT30&AU30),【準備】登録!$AI$5:$AL$28,3,FALSE)","v":"大橋　義治"},null,{"$f":"VLOOKUP(AX30,【準備】登録!$AK$4:$AL$27,2,FALSE)","v":180},null,null,{"$f":"IF(ISERROR(VLOOKUP($AX30&$AV$3&BC$4,【進行】結果入力表!$Q$7:$V$150,2,FALSE)),\"\",VLOOKUP($AX30&$AV$3&BC$4,【進行】結果入力表!$Q$7:$V$150,2,FALSE))","v":91},null,{"$f":"IF(ISERROR(VLOOKUP($AX30&$AV$3&BE$4,【進行】結果入力表!$Q$7:$V$150,2,FALSE)),\"\",VLOOKUP($AX30&$AV$3&BE$4,【進行】結果入力表!$Q$7:$V$150,2,FALSE))","v":"W"},null,{"$f":"IF(BE30=\"\",\"\",COUNTIF(BA30:BF30,\"w\"))","v":1},{"$f":"IF(BE30=\"\",\"\",COUNT(BC30,BE30))","v":1},{"$f":"SUM(BA30:BF30)+BG30*AZ30","v":271},null,{"$f":"IF(BE30=\"\",\"\",BI30/AZ30*180)","v":271},{"$f":"IF(BA31=\"w\",180,BA31/AZ30*180)+IF(BA32=\"w\",180,BA32/AZ30*180)","v":278},{"$f":"BG30*10000000+BK30*BG10029*10000000+BK30*1000-BL30","v":10270722},{"$f":"IF(BE30=\"\",\"\",RANK(BM30:BM32,BM30:BM32,0))","v":2}]
[2,6,null,{"$f":"IF(【準備】登録!$U$6<D29,\"\",D26)","v":"HRC"},null,{"$f":"IF(VLOOKUP(VALUE($A31&$D29),【準備】登録!$AI$5:$AL$28,3,FALSE)=0,\"\",VLOOKUP(VALUE($A31&$D29),【準備】登録!$AI$5:$AL$28,3,FALSE))","v":"河地　恵里"},null,{"$f":"VLOOKUP(F31,【準備】登録!$AK$4:$AL$27,2,FALSE)","v":140},{"$f":"IF(ISERROR(VLOOKUP($F31&$D$3&I$4,【進行】結果入力表!$Q$7:$V$150,2,FALSE)),\"\",VLOOKUP($F31&$D$3&I$4,【進行】結果入力表!$Q$7:$V$150,2,FALSE))","v":113},null,null,null,{"$f":"IF(ISERROR(VLOOKUP($F31&$D$3&M$4,【進行】結果入力表!$Q$7:$V$150,2,FALSE)),\"\",VLOOKUP($F31&$D$3&M$4,【進行】結果入力表!$Q$7:$V$150,2,FALSE))","v":"W"},null,{"$f":"IF(M30=\"\",\"\",COUNTIF(I31:N31,\"w\"))","v":1},{"$f":"IF(M30=\"\",\"\",COUNT(I31,M31))","v":1},{"$f":"SUM(I31:N31)+O31*H31","v":253},null,{"$f":"IF(M30=\"\",\"\",Q31/H31*180)","v":325.28571428571428},{"$f":"IF(K30=\"w\",180,K30/H31*180)+IF(K32=\"w\",180,K32/H31*180)","v":201.85714285714286},{"$f":"O31*10000000+S31*O10030*10000000+S31*1000-T31","v":10325083.857142858},{"$f":"IF(M30=\"\",\"\",RANK(U30:U32,U30:U32,0))","v":2},null,2,{"$f":"IF(【準備】登録!U6=5,\"\",IF(【準備】登録!U6=6,1,7))","v":1},{"$f":"IF(【準備】登録!$U$6<Z29,\"\",Z26)","v":"HRC"},null,{"$f":"VLOOKUP(VALUE(X31&Y31),【準備】登録!$AI$5:$AL$28,3,FALSE)","v":"高木　俊行"},null,{"$f":"VLOOKUP(AB31,【準備】登録!$AK$4:$AL$27,2,FALSE)","v":180},{"$f":"IF(ISERROR(VLOOKUP($AB31&$Z$3&AE$4,【進行】結果入力表!$Q$7:$V$150,2,FALSE)),\"\",VLOOKUP($AB31&$Z$3&AE$4,【進行】結果入力表!$Q$7:$V$150,2,FALSE))","v":128},null,null,null,{"$f":"IF(ISERROR(VLOOKUP($AB31&$Z$3&AI$4,【進行】結果入力表!$Q$7:$V$150,2,FALSE)),\"\",VLOOKUP($AB31&$Z$3&AI$4,【進行】結果入力表!$Q$7:$V$150,2,FALSE))","v":"W"},null,{"$f":"IF(AI30=\"\",\"\",COUNTIF(AE31:AJ31,\"w\"))","v":1},{"$f":"IF(AI30=\"\",\"\",COUNT(AE31,AI31))","v":1},{"$f":"SUM(AE31:AJ31)+AK31*AD31","v":308},null,{"$f":"IF(AI30=\"\",\"\",AM31/AD31*180)","v":308},{"$f":"IF(AG30=\"w\",180,AG30/AD31*180)+IF(AG32=\"w\",180,AG32/AD31*180)","v":236},{"$f":"AK31*10000000+AO31*AK10030*10000000+AO31*1000-AP31","v":10307764},{"$f":"IF(AI30=\"\",\"\",RANK(AQ30:AQ32,AQ30:AQ32,0))","v":2},null,2,2,{"$f":"IF(【準備】登録!$U$6<AV29,\"\",AV26)","v":"HRC"},null,{"$f":"VLOOKUP(VALUE(AT31&AU31),【準備】登録!$AI$5:$AL$28,3,FALSE)","v":"金井　健太郎"},null,{"$f":"VLOOKUP(AX31,【準備】登録!$AK$4:$AL$27,2,FALSE)","v":180},{"$f":"IF(ISERROR(VLOOKUP($AX31&$AV$3&BA$4,【進行】結果入力表!$Q$7:$V$150,2,FALSE)),\"\",VLOOKUP($AX31&$AV$3&BA$4,【進行】結果入力表!$Q$7:$V$150,2,FALSE))","v":"W"},null,null,null,{"$f":"IF(ISERROR(VLOOKUP($AX31&$AV$3&BE$4,【進行】結果入力表!$Q$7:$V$150,2,FALSE)),\"\",VLOOKUP($AX31&$AV$3&BE$4,【進行】結果入力表!$Q$7:$V$150,2,FALSE))","v":"W"},null,{"$f":"IF(BE30=\"\",\"\",COUNTIF(BA31:BF31,\"w\"))","v":2},{"$f":"IF(BE30=\"\",\"\",COUNT(BA31,BE31))","v":0},{"$f":"SUM(BA31:BF31)+BG31*AZ31","v":360},null,{"$f":"IF(BE30=\"\",\"\",BI31/AZ31*180)","v":360},{"$f":"IF(BC30=\"w\",180,BC30/AZ31*180)+IF(BC32=\"w\",180,BC32/AZ31*180)","v":146},{"$f":"BG31*10000000+BK31*BG10030*10000000+BK31*1000-BL31","v":20359854},{"$f":"IF(BE30=\"\",\"\",RANK(BM30:BM32,BM30:BM32,0))","v":1}]
[1,6,null,{"$f":"IF(【準備】登録!$U$6<D29,\"\",D27)","v":"NRC"},null,{"$f":"IF(VLOOKUP(VALUE($A32&$D29),【準備】登録!$AI$5:$AL$28,3,FALSE)=0,\"\",VLOOKUP(VALUE($A32&$D29),【準備】登録!$AI$5:$AL$28,3,FALSE))","v":"宮野　早織"},null,{"$f":"VLOOKUP(F32,【準備】登録!$AK$4:$AL$27,2,FALSE)","v":140},{"$f":"IF(ISERROR(VLOOKUP($F32&$D$3&I$4,【進行】結果入力表!$Q$7:$V$150,2,FALSE)),\"\",VLOOKUP($F32&$D$3&I$4,【進行】結果入力表!$Q$7:$V$150,2,FALSE))","v":"W"},null,{"$f":"IF(ISERROR(VLOOKUP($F32&$D$3&K$4,【進行】結果入力表!$Q$7:$V$150,2,FALSE)),\"\",VLOOKUP($F32&$D$3&K$4,【進行】結果入力表!$Q$7:$V$150,2,FALSE))","v":17},null,null,null,{"$f":"IF(M30=\"\",\"\",COUNTIF(I32:N32,\"w\"))","v":1},{"$f":"IF(M30=\"\",\"\",COUNT(I32,K32))","v":1},{"$f":"SUM(I32:N32)+O32*H32","v":157},null,{"$f":"IF(M30=\"\",\"\",Q32/H32*180)","v":201.85714285714286},{"$f":"IF(M30=\"w\",180,M30/H32*180)+IF(M31=\"w\",180,M31/H32*180)","v":329.14285714285711},{"$f":"O32*10000000+S32*O10031*10000000+S32*1000-T32","v":10201528},{"$f":"IF(M30=\"\",\"\",RANK(U30:U32,U30:U32,0))","v":3},null,1,6,{"$f":"IF(【準備】登録!$U$6<Z29,\"\",Z27)","v":"NRC"},null,{"$f":"VLOOKUP(VALUE(X32&Y32),【準備】登録!$AI$5:$AL$28,3,FALSE)","v":"宮野　早織"},null,{"$f":"VLOOKUP(AB32,【準備】登録!$AK$4:$AL$27,2,FALSE)","v":140},{"$f":"IF(ISERROR(VLOOKUP($AB32&$Z$3&AE$4,【進行】結果入力表!$Q$7:$V$150,2,FALSE)),\"\",VLOOKUP($AB32&$Z$3&AE$4,【進行】結果入力表!$Q$7:$V$150,2,FALSE))","v":102},null,{"$f":"IF(ISERROR(VLOOKUP($AB32&$Z$3&AG$4,【進行】結果入力表!$Q$7:$V$150,2,FALSE)),\"\",VLOOKUP($AB32&$Z$3&AG$4,【進行】結果入力表!$Q$7:$V$150,2,FALSE))","v":56},null,null,null,{"$f":"IF(AI30=\"\",\"\",COUNTIF(AE32:AJ32,\"w\"))","v":0},{"$f":"IF(AI30=\"\",\"\",COUNT(AE32,AG32))","v":2},{"$f":"SUM(AE32:AJ32)+AK32*AD32","v":158},null,{"$f":"IF(AI30=\"\",\"\",AM32/AD32*180)","v":203.14285714285714},{"$f":"IF(AI30=\"w\",180,AI30/AD32*180)+IF(AI31=\"w\",180,AI31/AD32*180)","v":360},{"$f":"AK32*10000000+AO32*AK10031*10000000+AO32*1000-AP32","v":202782.85714285713},{"$f":"IF(AI30=\"\",\"\",RANK(AQ30:AQ32,AQ30:AQ32,0))","v":3},null,1,6,{"$f":"IF(【準備】登録!$U$6<AV29,\"\",AV27)","v":"NRC"},null,{"$f":"VLOOKUP(VALUE(AT32&AU32),【準備】登録!$AI$5:$AL$28,3,FALSE)","v":"宮野　早織"},null,{"$f":"VLOOKUP(AX32,【準備】登録!$AK$4:$AL$27,2,FALSE)","v":140},{"$f":"IF(ISERROR(VLOOKUP($AX32&$AV$3&BA$4,【進行】結果入力表!$Q$7:$V$150,2,FALSE)),\"\",VLOOKUP($AX32&$AV$3&BA$4,【進行】結果入力表!$Q$7:$V$150,2,FALSE))","v":98},null,{"$f":"IF(ISERROR(VLOOKUP($AX32&$AV$3&BC$4,【進行】結果入力表!$Q$7:$V$150,2,FALSE)),\"\",VLOOKUP($AX32&$AV$3&BC$4,【進行】結果入力表!$Q$7:$V$150,2,FALSE))","v":55},null,null,null,{"$f":"IF(BE30=\"\",\"\",COUNTIF(BA32:BF32,\"w\"))","v":0},{"$f":"IF(BE30=\"\",\"\",COUNT(BA32,BC32))","v":2},{"$f":"SUM(BA32:BF32)+BG32*AZ32","v":153},null,{"$f":"IF(BE30=\"\",\"\",BI32/AZ32*180)","v":196.71428571428569},{"$f":"IF(BE30=\"w\",180,BE30/AZ32*180)+IF(BE31=\"w\",180,BE31/AZ32*180)","v":360},{"$f":"BG32*10000000+BK32*BG10031*10000000+BK32*1000-BL32","v":196354.28571428568},{"$f":"IF(BE30=\"\",\"\",RANK(BM30:BM32,BM30:BM32,0))","v":3}]
[]
[null,null,null,7,null,"Name",null,{"$f":"H$4","v":"持点"},{"$f":"$D$5","v":"SBC"},null,{"$f":"$D$6","v":"HRC"},null,{"$f":"$D$7","v":"NRC"},null,"W","L","TP",null,"TP","LP","R_P","R",null,null,null,7,null,"Name",null,{"$f":"$H$4","v":"持点"},{"$f":"$D$5","v":"SBC"},null,{"$f":"$D$6","v":"HRC"},null,{"$f":"$D$7","v":"NRC"},null,"W","L","TP",null,"TP","LP","R_P","R",null,null,null,7,null,"Name",null,{"$f":"$H$4","v":"持点"},{"$f":"$D$5","v":"SBC"},null,{"$f":"$D$6","v":"HRC"},null,{"$f":"$D$7","v":"NRC"},null,"W","L","TP",null,"TP","LP","R_P","R"]
[3,7,null,{"$f":"IF(【準備】登録!$U$6<D34,\"\",D30)","v":""},null,{"$f":"IF(VLOOKUP(VALUE($A35&$D34),【準備】登録!$AI$5:$AL$28,3,FALSE)=0,\"\",VLOOKUP(VALUE($A35&$D34),【準備】登録!$AI$5:$AL$28,3,FALSE))","v":""},null,{"$f":"VLOOKUP(F35,【準備】登録!$AK$4:$AL$27,2,FALSE)","v":{"$error":"#N/A"}},null,null,{"$f":"IF(ISERROR(VLOOKUP($F35&$D$3&K$4,【進行】結果入力表!$Q$7:$V$150,2,FALSE)),\"\",VLOOKUP($F35&$D$3&K$4,【進行】結果入力表!$Q$7:$V$150,2,FALSE))","v":""},null,{"$f":"IF(ISERROR(VLOOKUP($F35&$D$3&M$4,【進行】結果入力表!$Q$7:$V$150,2,FALSE)),\"\",VLOOKUP($F35&$D$3&M$4,【進行】結果入力表!$Q$7:$V$150,2,FALSE))","v":""},null,{"$f":"IF(M35=\"\",\"\",COUNTIF(I35:N35,\"w\"))","v":""},{"$f":"IF(M35=\"\",\"\",COUNT(K35,M35))","v":""},{"$f":"SUM(I35:N35)+O35*H35","v":{"$error":"#VALUE!"}},null,{"$f":"IF(M35=\"\",\"\",Q35/H35*180)","v":""},{"$f":"IF(I36=\"w\",180,I36/H35*180)+IF(I37=\"w\",180,I37/H35*180)","v":{"$error":"#VALUE!"}},{"$f":"O35*10000000+S35*O10034*10000000+S35*1000-T35","v":{"$error":"#VALUE!"}},{"$f":"IF(M35=\"\",\"\",RANK(U35:U37,U35:U37,0))","v":""},null,3,{"$f":"IF(【準備】登録!U6<7,\"\",IF(【準備】登録!U6=7,1,IF(【準備】登録!U6=8,8)))","v":""},{"$f":"IF(【準備】登録!$U$6<Z34,\"\",Z30)","v":""},null,{"$f":"IF(VLOOKUP(VALUE($A35&$D34),【準備】登録!$AI$5:$AL$28,3,FALSE)=0,\"\",VLOOKUP(VALUE($A35&$D34),【準備】登録!$AI$5:$AL$28,3,FALSE))","v":""},null,{"$f":"VLOOKUP(AB35,【準備】登録!$AK$4:$AL$27,2,FALSE)","v":{"$error":"#N/A"}},null,null,{"$f":"IF(ISERROR(VLOOKUP($AB35&$Z$3&AG$4,【進行】結果入力表!$Q$7:$V$150,2,FALSE)),\"\",VLOOKUP($AB35&$Z$3&AG$4,【進行】結果入力表!$Q$7:$V$150,2,FALSE))","v":""},null,{"$f":"IF(ISERROR(VLOOKUP($AB35&$Z$3&AI$4,【進行】結果入力表!$Q$7:$V$150,2,FALSE)),\"\",VLOOKUP($AB35&$Z$3&AI$4,【進行】結果入力表!$Q$7:$V$150,2,FALSE))","v":""},null,{"$f":"IF(AI35=\"\",\"\",COUNTIF(AE35:AJ35,\"w\"))","v":""},{"$f":"IF(AI35=\"\",\"\",COUNT(AG35,AI35))","v":""},{"$f":"SUM(AE35:AJ35)+AK35*AD35","v":{"$error":"#VALUE!"}},null,{"$f":"IF(AI35=\"\",\"\",AM35/AD35*180)","v":""},{"$f":"IF(AE36=\"w\",180,AE36/AD35*180)+IF(AE37=\"w\",180,AE37/AD35*180)","v":{"$error":"#VALUE!"}},{"$f":"AK35*10000000+AO35*AK10034*10000000+AO35*1000-AP35","v":{"$error":"#VALUE!"}},{"$f":"IF(AI35=\"\",\"\",RANK(AQ35:AQ37,AQ35:AQ37,0))","v":""},null,3,null,{"$f":"IF(【準備】登録!$U$6<AV34,\"\",AV30)","v":""},null,{"$f":"IF(VLOOKUP(VALUE($A35&$D34),【準備】登録!$AI$5:$AL$28,3,FALSE)=0,\"\",VLOOKUP(VALUE($A35&$D34),【準備】登録!$AI$5:$AL$28,3,FALSE))","v":""},null,{"$f":"VLOOKUP(AX35,【準備】登録!$AK$4:$AL$27,2,FALSE)","v":{"$error":"#N/A"}},null,null,{"$f":"IF(ISERROR(VLOOKUP($AX35&$AV$3&BC$4,【進行】結果入力表!$Q$7:$V$150,2,FALSE)),\"\",VLOOKUP($AX35&$AV$3&BC$4,【進行】結果入力表!$Q$7:$V$150,2,FALSE))","v":""},null,{"$f":"IF(ISERROR(VLOOKUP($AX35&$AV$3&BE$4,【進行】結果入力表!$Q$7:$V$150,2,FALSE)),\"\",VLOOKUP($AX35&$AV$3&BE$4,【進行】結果入力表!$Q$7:$V$150,2,FALSE))","v":""},null,{"$f":"IF(BE35=\"\",\"\",COUNTIF(BA35:BF35,\"w\"))","v":""},{"$f":"IF(BE35=\"\",\"\",COUNT(BC35,BE35))","v":""},{"$f":"SUM(BA35:BF35)+BG35*AZ35","v":{"$error":"#VALUE!"}},null,{"$f":"IF(BE35=\"\",\"\",BI35/AZ35*180)","v":""},{"$f":"IF(BA36=\"w\",180,BA36/AZ35*180)+IF(BA37=\"w\",180,BA37/AZ35*180)","v":{"$error":"#VALUE!"}},{"$f":"BG35*10000000+BK35*BG10034*10000000+BK35*1000-BL35","v":{"$error":"#VALUE!"}},{"$f":"IF(BE35=\"\",\"\",RANK(BM35:BM37,BM35:BM37,0))","v":""}]
[2,7,null,{"$f":"IF(【準備】登録!$U$6<D34,\"\",D31)","v":""},null,{"$f":"IF(VLOOKUP(VALUE($A36&$D34),【準備】登録!$AI$5:$AL$28,3,FALSE)=0,\"\",VLOOKUP(VALUE($A36&$D34),【準備】登録!$AI$5:$AL$28,3,FALSE))","v":""},null,{"$f":"VLOOKUP(F36,【準備】登録!$AK$4:$AL$27,2,FALSE)","v":{"$error":"#N/A"}},{"$f":"IF(ISERROR(VLOOKUP($F36&$D$3&I$4,【進行】結果入力表!$Q$7:$V$150,2,FALSE)),\"\",VLOOKUP($F36&$D$3&I$4,【進行】結果入力表!$Q$7:$V$150,2,FALSE))","v":""},null,null,null,{"$f":"IF(ISERROR(VLOOKUP($F36&$D$3&M$4,【進行】結果入力表!$Q$7:$V$150,2,FALSE)),\"\",VLOOKUP($F36&$D$3&M$4,【進行】結果入力表!$Q$7:$V$150,2,FALSE))","v":""},null,{"$f":"IF(M35=\"\",\"\",COUNTIF(I36:N36,\"w\"))","v":""},{"$f":"IF(M35=\"\",\"\",COUNT(I36,M36))","v":""},{"$f":"SUM(I36:N36)+O36*H36","v":{"$error":"#VALUE!"}},null,{"$f":"IF(M35=\"\",\"\",Q36/H36*180)","v":""},{"$f":"IF(K35=\"w\",180,K35/H36*180)+IF(K37=\"w\",180,K37/H36*180)","v":{"$error":"#VALUE!"}},{"$f":"O36*10000000+S36*O10035*10000000+S36*1000-T36","v":{"$error":"#VALUE!"}},{"$f":"IF(M35=\"\",\"\",RANK(U35:U37,U35:U37,0))","v":""},null,2,{"$f":"IF(【準備】登録!U6<7,\"\",IF(【準備】登録!U6=7,1,8))","v":""},{"$f":"IF(【準備】登録!$U$6<Z34,\"\",Z31)","v":""},null,{"$f":"IF(VLOOKUP(VALUE($A36&$D34),【準備】登録!$AI$5:$AL$28,3,FALSE)=0,\"\",VLOOKUP(VALUE($A36&$D34),【準備】登録!$AI$5:$AL$28,3,FALSE))","v":""},null,{"$f":"VLOOKUP(AB36,【準備】登録!$AK$4:$AL$27,2,FALSE)","v":{"$error":"#N/A"}},{"$f":"IF(ISERROR(VLOOKUP($AB36&$Z$3&AE$4,【進行】結果入力表!$Q$7:$V$150,2,FALSE)),\"\",VLOOKUP($AB36&$Z$3&AE$4,【進行】結果入力表!$Q$7:$V$150,2,FALSE))","v":""},null,null,null,{"$f":"IF(ISERROR(VLOOKUP($AB36&$Z$3&AI$4,【進行】結果入力表!$Q$7:$V$150,2,FALSE)),\"\",VLOOKUP($AB36&$Z$3&AI$4,【進行】結果入力表!$Q$7:$V$150,2,FALSE))","v":""},null,{"$f":"IF(AI35=\"\",\"\",COUNTIF(AE36:AJ36,\"w\"))","v":""},{"$f":"IF(AI35=\"\",\"\",COUNT(AE36,AI36))","v":""},{"$f":"SUM(AE36:AJ36)+AK36*AD36","v":{"$error":"#VALUE!"}},null,{"$f":"IF(AI35=\"\",\"\",AM36/AD36*180)","v":""},{"$f":"IF(AG35=\"w\",180,AG35/AD36*180)+IF(AG37=\"w\",180,AG37/AD36*180)","v":{"$error":"#VALUE!"}},{"$f":"AK36*10000000+AO36*AK10035*10000000+AO36*1000-AP36","v":{"$error":"#VALUE!"}},{"$f":"IF(AI35=\"\",\"\",RANK(AQ35:AQ37,AQ35:AQ37,0))","v":""},null,2,null,{"$f":"IF(【準備】登録!$U$6<AV34,\"\",AV31)","v":""},null,{"$f":"IF(VLOOKUP(VALUE($A36&$D34),【準備】登録!$AI$5:$AL$28,3,FALSE)=0,\"\",VLOOKUP(VALUE($A36&$D34),【準備】登録!$AI$5:$AL$28,3,FALSE))","v":""},null,{"$f":"VLOOKUP(AX36,【準備】登録!$AK$4:$AL$27,2,FALSE)","v":{"$error":"#N/A"}},{"$f":"IF(ISERROR(VLOOKUP($AX36&$AV$3&BA$4,【進行】結果入力表!$Q$7:$V$150,2,FALSE)),\"\",VLOOKUP($AX36&$AV$3&BA$4,【進行】結果入力表!$Q$7:$V$150,2,FALSE))","v":""},null,null,null,{"$f":"IF(ISERROR(VLOOKUP($AX36&$AV$3&BE$4,【進行】結果入力表!$Q$7:$V$150,2,FALSE)),\"\",VLOOKUP($AX36&$AV$3&BE$4,【進行】結果入力表!$Q$7:$V$150,2,FALSE))","v":""},null,{"$f":"IF(BE35=\"\",\"\",COUNTIF(BA36:BF36,\"w\"))","v":""},{"$f":"IF(BE35=\"\",\"\",COUNT(BA36,BE36))","v":""},{"$f":"SUM(BA36:BF36)+BG36*AZ36","v":{"$error":"#VALUE!"}},null,{"$f":"IF(BE35=\"\",\"\",BI36/AZ36*180)","v":""},{"$f":"IF(BC35=\"w\",180,BC35/AZ36*180)+IF(BC37=\"w\",180,BC37/AZ36*180)","v":{"$error":"#VALUE!"}},{"$f":"BG36*10000000+BK36*BG10035*10000000+BK36*1000-BL36","v":{"$error":"#VALUE!"}},{"$f":"IF(BE35=\"\",\"\",RANK(BM35:BM37,BM35:BM37,0))","v":""}]
[1,7,null,{"$f":"IF(【準備】登録!$U$6<D34,\"\",D32)","v":""},null,{"$f":"IF(VLOOKUP(VALUE($A37&$D34),【準備】登録!$AI$5:$AL$28,3,FALSE)=0,\"\",VLOOKUP(VALUE($A37&$D34),【準備】登録!$AI$5:$AL$28,3,FALSE))","v":""},null,{"$f":"VLOOKUP(F37,【準備】登録!$AK$4:$AL$27,2,FALSE)","v":{"$error":"#N/A"}},{"$f":"IF(ISERROR(VLOOKUP($F37&$D$3&I$4,【進行】結果入力表!$Q$7:$V$150,2,FALSE)),\"\",VLOOKUP($F37&$D$3&I$4,【進行】結果入力表!$Q$7:$V$150,2,FALSE))","v":""},null,{"$f":"IF(ISERROR(VLOOKUP($F37&$D$3&K$4,【進行】結果入力表!$Q$7:$V$150,2,FALSE)),\"\",VLOOKUP($F37&$D$3&K$4,【進行】結果入力表!$Q$7:$V$150,2,FALSE))","v":""},null,null,null,{"$f":"IF(M35=\"\",\"\",COUNTIF(I37:N37,\"w\"))","v":""},{"$f":"IF(M35=\"\",\"\",COUNT(I37,K37))","v":""},{"$f":"SUM(I37:N37)+O37*H37","v":{"$error":"#VALUE!"}},null,{"$f":"IF(M35=\"\",\"\",Q37/H37*180)","v":""},{"$f":"IF(M35=\"w\",180,M35/H37*180)+IF(M36=\"w\",180,M36/H37*180)","v":{"$error":"#VALUE!"}},{"$f":"O37*10000000+S37*O10036*10000000+S37*1000-T37","v":{"$error":"#VALUE!"}},{"$f":"IF(M35=\"\",\"\",RANK(U35:U37,U35:U37,0))","v":""},null,1,7,{"$f":"IF(【準備】登録!$U$6<Z34,\"\",Z32)","v":""},null,{"$f":"IF(VLOOKUP(VALUE($A37&$D34),【準備】登録!$AI$5:$AL$28,3,FALSE)=0,\"\",VLOOKUP(VALUE($A37&$D34),【準備】登録!$AI$5:$AL$28,3,FALSE))","v":""},null,{"$f":"VLOOKUP(AB37,【準備】登録!$AK$4:$AL$27,2,FALSE)","v":{"$error":"#N/A"}},{"$f":"IF(ISERROR(VLOOKUP($AB37&$Z$3&AE$4,【進行】結果入力表!$Q$7:$V$150,2,FALSE)),\"\",VLOOKUP($AB37&$Z$3&AE$4,【進行】結果入力表!$Q$7:$V$150,2,FALSE))","v":""},null,{"$f":"IF(ISERROR(VLOOKUP($AB37&$Z$3&AG$4,【進行】結果入力表!$Q$7:$V$150,2,FALSE)),\"\",VLOOKUP($AB37&$Z$3&AG$4,【進行】結果入力表!$Q$7:$V$150,2,FALSE))","v":""},null,null,null,{"$f":"IF(AI35=\"\",\"\",COUNTIF(AE37:AJ37,\"w\"))","v":""},{"$f":"IF(AI35=\"\",\"\",COUNT(AE37,AG37))","v":""},{"$f":"SUM(AE37:AJ37)+AK37*AD37","v":{"$error":"#VALUE!"}},null,{"$f":"IF(AI35=\"\",\"\",AM37/AD37*180)","v":""},{"$f":"IF(AI35=\"w\",180,AI35/AD37*180)+IF(AI36=\"w\",180,AI36/AD37*180)","v":{"$error":"#VALUE!"}},{"$f":"AK37*10000000+AO37*AK10036*10000000+AO37*1000-AP37","v":{"$error":"#VALUE!"}},{"$f":"IF(AI35=\"\",\"\",RANK(AQ35:AQ37,AQ35:AQ37,0))","v":""},null,1,7,{"$f":"IF(【準備】登録!$U$6<AV34,\"\",AV32)","v":""},null,{"$f":"IF(VLOOKUP(VALUE($A37&$D34),【準備】登録!$AI$5:$AL$28,3,FALSE)=0,\"\",VLOOKUP(VALUE($A37&$D34),【準備】登録!$AI$5:$AL$28,3,FALSE))","v":""},null,{"$f":"VLOOKUP(AX37,【準備】登録!$AK$4:$AL$27,2,FALSE)","v":{"$error":"#N/A"}},{"$f":"IF(ISERROR(VLOOKUP($AX37&$AV$3&BA$4,【進行】結果入力表!$Q$7:$V$150,2,FALSE)),\"\",VLOOKUP($AX37&$AV$3&BA$4,【進行】結果入力表!$Q$7:$V$150,2,FALSE))","v":""},null,{"$f":"IF(ISERROR(VLOOKUP($AX37&$AV$3&BC$4,【進行】結果入力表!$Q$7:$V$150,2,FALSE)),\"\",VLOOKUP($AX37&$AV$3&BC$4,【進行】結果入力表!$Q$7:$V$150,2,FALSE))","v":""},null,null,null,{"$f":"IF(BE35=\"\",\"\",COUNTIF(BA37:BF37,\"w\"))","v":""},{"$f":"IF(BE35=\"\",\"\",COUNT(BA37,BC37))","v":""},{"$f":"SUM(BA37:BF37)+BG37*AZ37","v":{"$error":"#VALUE!"}},null,{"$f":"IF(BE35=\"\",\"\",BI37/AZ37*180)","v":""},{"$f":"IF(BE35=\"w\",180,BE35/AZ37*180)+IF(BE36=\"w\",180,BE36/AZ37*180)","v":{"$error":"#VALUE!"}},{"$f":"BG37*10000000+BK37*BG10036*10000000+BK37*1000-BL37","v":{"$error":"#VALUE!"}},{"$f":"IF(BE35=\"\",\"\",RANK(BM35:BM37,BM35:BM37,0))","v":""}]
[]
[null,null,null,8,null,"Name",null,{"$f":"H$4","v":"持点"},{"$f":"$D$40","v":""},null,{"$f":"$D$41","v":""},null,{"$f":"$D$42","v":""},null,"W","L","TP",null,"TP","LP","R_P","R",null,null,null,8,null,"Name",null,{"$f":"$H$4","v":"持点"},{"$f":"$D$40","v":""},null,{"$f":"$D$41","v":""},null,{"$f":"$D$42","v":""},null,"W","L","TP",null,"TP","LP","R_P","R",null,null,null,8,null,"Name",null,{"$f":"$H$4","v":"持点"},{"$f":"$D$40","v":""},null,{"$f":"$D$41","v":""},null,{"$f":"$D$42","v":""},null,"W","L","TP",null,"TP","LP","R_P","R"]
[3,8,null,{"$f":"IF(【準備】登録!$U$6<D39,\"\",D35)","v":""},null,{"$f":"IF(VLOOKUP(VALUE($A40&$D39),【準備】登録!$AI$5:$AL$28,3,FALSE)=0,\"\",VLOOKUP(VALUE($A40&$D39),【準備】登録!$AI$5:$AL$28,3,FALSE))","v":""},null,{"$f":"VLOOKUP(F40,【準備】登録!$AK$4:$AL$27,2,FALSE)","v":{"$error":"#N/A"}},null,null,{"$f":"IF(ISERROR(VLOOKUP($F40&$D$3&K$4,【進行】結果入力表!$Q$7:$V$150,2,FALSE)),\"\",VLOOKUP($F40&$D$3&K$4,【進行】結果入力表!$Q$7:$V$150,2,FALSE))","v":""},null,{"$f":"IF(ISERROR(VLOOKUP($F40&$D$3&M$4,【進行】結果入力表!$Q$7:$V$150,2,FALSE)),\"\",VLOOKUP($F40&$D$3&M$4,【進行】結果入力表!$Q$7:$V$150,2,FALSE))","v":""},null,{"$f":"IF(M40=\"\",\"\",COUNTIF(I40:N40,\"w\"))","v":""},{"$f":"IF(M40=\"\",\"\",COUNT(K40,M40))","v":""},{"$f":"SUM(I40:N40)+O40*H40","v":{"$error":"#VALUE!"}},null,{"$f":"IF(M40=\"\",\"\",Q40/H40*180)","v":""},{"$f":"IF(I41=\"w\",180,I41/H40*180)+IF(I42=\"w\",180,I42/H40*180)","v":{"$error":"#VALUE!"}},{"$f":"O40*10000000+S40*O10039*10000000+S40*1000-T40","v":{"$error":"#VALUE!"}},{"$f":"IF(M40=\"\",\"\",RANK(U40:U42,U40:U42,0))","v":""},null,3,2,{"$f":"IF(【準備】登録!$U$6<Z39,\"\",Z35)","v":""},null,{"$f":"IF(VLOOKUP(VALUE($A40&$D39),【準備】登録!$AI$5:$AL$28,3,FALSE)=0,\"\",VLOOKUP(VALUE($A40&$D39),【準備】登録!$AI$5:$AL$28,3,FALSE))","v":""},null,{"$f":"VLOOKUP(AB40,【準備】登録!$AK$4:$AL$27,2,FALSE)","v":{"$error":"#N/A"}},null,null,{"$f":"IF(ISERROR(VLOOKUP($AB40&$Z$3&AG$4,【進行】結果入力表!$Q$7:$V$150,2,FALSE)),\"\",VLOOKUP($AB40&$Z$3&AG$4,【進行】結果入力表!$Q$7:$V$150,2,FALSE))","v":""},null,{"$f":"IF(ISERROR(VLOOKUP($AB40&$Z$3&AI$4,【進行】結果入力表!$Q$7:$V$150,2,FALSE)),\"\",VLOOKUP($AB40&$Z$3&AI$4,【進行】結果入力表!$Q$7:$V$150,2,FALSE))","v":""},null,{"$f":"IF(AI40=\"\",\"\",COUNTIF(AE40:AJ40,\"w\"))","v":""},{"$f":"IF(AI40=\"\",\"\",COUNT(AG40,AI40))","v":""},{"$f":"SUM(AE40:AJ40)+AK40*AD40","v":{"$error":"#VALUE!"}},null,{"$f":"IF(AI40=\"\",\"\",AM40/AD40*180)","v":""},{"$f":"IF(AE41=\"w\",180,AE41/AD40*180)+IF(AE42=\"w\",180,AE42/AD40*180)","v":{"$error":"#VALUE!"}},{"$f":"AK40*10000000+AO40*AK10039*10000000+AO40*1000-AP40","v":{"$error":"#VALUE!"}},{"$f":"IF(AI40=\"\",\"\",RANK(AQ40:AQ42,AQ40:AQ42,0))","v":""},null,3,4,{"$f":"IF(【準備】登録!$U$6<AV39,\"\",AV35)","v":""},null,{"$f":"IF(VLOOKUP(VALUE($A40&$D39),【準備】登録!$AI$5:$AL$28,3,FALSE)=0,\"\",VLOOKUP(VALUE($A40&$D39),【準備】登録!$AI$5:$AL$28,3,FALSE))","v":""},null,{"$f":"VLOOKUP(AX40,【準備】登録!$AK$4:$AL$27,2,FALSE)","v":{"$error":"#N/A"}},null,null,{"$f":"IF(ISERROR(VLOOKUP($AX40&$AV$3&BC$4,【進行】結果入力表!$Q$7:$V$150,2,FALSE)),\"\",VLOOKUP($AX40&$AV$3&BC$4,【進行】結果入力表!$Q$7:$V$150,2,FALSE))","v":""},null,{"$f":"IF(ISERROR(VLOOKUP($AX40&$AV$3&BE$4,【進行】結果入力表!$Q$7:$V$150,2,FALSE)),\"\",VLOOKUP($AX40&$AV$3&BE$4,【進行】結果入力表!$Q$7:$V$150,2,FALSE))","v":""},null,{"$f":"IF(BE40=\"\",\"\",COUNTIF(BA40:BF40,\"w\"))","v":""},{"$f":"IF(BE40=\"\",\"\",COUNT(BC40,BE40))","v":""},{"$f":"SUM(BA40:BF40)+BG40*AZ40","v":{"$error":"#VALUE!"}},null,{"$f":"IF(BE40=\"\",\"\",BI40/AZ40*180)","v":""},{"$f":"IF(BA41=\"w\",180,BA41/AZ40*180)+IF(BA42=\"w\",180,BA42/AZ40*180)","v":{"$error":"#VALUE!"}},{"$f":"BG40*10000000+BK40*BG10039*10000000+BK40*1000-BL40","v":{"$error":"#VALUE!"}},{"$f":"IF(BE40=\"\",\"\",RANK(BM40:BM42,BM40:BM42,0))","v":""}]
[2,8,null,{"$f":"IF(【準備】登録!$U$6<D39,\"\",D36)","v":""},null,{"$f":"IF(VLOOKUP(VALUE($A41&$D39),【準備】登録!$AI$5:$AL$28,3,FALSE)=0,\"\",VLOOKUP(VALUE($A41&$D39),【準備】登録!$AI$5:$AL$28,3,FALSE))","v":""},null,{"$f":"VLOOKUP(F41,【準備】登録!$AK$4:$AL$27,2,FALSE)","v":{"$error":"#N/A"}},{"$f":"IF(ISERROR(VLOOKUP($F41&$D$3&I$4,【進行】結果入力表!$Q$7:$V$150,2,FALSE)),\"\",VLOOKUP($F41&$D$3&I$4,【進行】結果入力表!$Q$7:$V$150,2,FALSE))","v":""},null,null,null,{"$f":"IF(ISERROR(VLOOKUP($F41&$D$3&M$4,【進行】結果入力表!$Q$7:$V$150,2,FALSE)),\"\",VLOOKUP($F41&$D$3&M$4,【進行】結果入力表!$Q$7:$V$150,2,FALSE))","v":""},null,{"$f":"IF(M40=\"\",\"\",COUNTIF(I41:N41,\"w\"))","v":""},{"$f":"IF(M40=\"\",\"\",COUNT(I41,M41))","v":""},{"$f":"SUM(I41:N41)+O41*H41","v":{"$error":"#VALUE!"}},null,{"$f":"IF(M40=\"\",\"\",Q41/H41*180)","v":""},{"$f":"IF(K40=\"w\",180,K40/H41*180)+IF(K42=\"w\",180,K42/H41*180)","v":{"$error":"#VALUE!"}},{"$f":"O41*10000000+S41*O10040*10000000+S41*1000-T41","v":{"$error":"#VALUE!"}},{"$f":"IF(M40=\"\",\"\",RANK(U40:U42,U40:U42,0))","v":""},null,2,1,{"$f":"IF(【準備】登録!$U$6<Z39,\"\",Z36)","v":""},null,{"$f":"IF(VLOOKUP(VALUE($A41&$D39),【準備】登録!$AI$5:$AL$28,3,FALSE)=0,\"\",VLOOKUP(VALUE($A41&$D39),【準備】登録!$AI$5:$AL$28,3,FALSE))","v":""},null,{"$f":"VLOOKUP(AB41,【準備】登録!$AK$4:$AL$27,2,FALSE)","v":{"$error":"#N/A"}},{"$f":"IF(ISERROR(VLOOKUP($AB41&$Z$3&AE$4,【進行】結果入力表!$Q$7:$V$150,2,FALSE)),\"\",VLOOKUP($AB41&$Z$3&AE$4,【進行】結果入力表!$Q$7:$V$150,2,FALSE))","v":""},null,null,null,{"$f":"IF(ISERROR(VLOOKUP($AB41&$Z$3&AI$4,【進行】結果入力表!$Q$7:$V$150,2,FALSE)),\"\",VLOOKUP($AB41&$Z$3&AI$4,【進行】結果入力表!$Q$7:$V$150,2,FALSE))","v":""},null,{"$f":"IF(AI40=\"\",\"\",COUNTIF(AE41:AJ41,\"w\"))","v":""},{"$f":"IF(AI40=\"\",\"\",COUNT(AE41,AI41))","v":""},{"$f":"SUM(AE41:AJ41)+AK41*AD41","v":{"$error":"#VALUE!"}},null,{"$f":"IF(AI40=\"\",\"\",AM41/AD41*180)","v":""},{"$f":"IF(AG40=\"w\",180,AG40/AD41*180)+IF(AG42=\"w\",180,AG42/AD41*180)","v":{"$error":"#VALUE!"}},{"$f":"AK41*10000000+AO41*AK10040*10000000+AO41*1000-AP41","v":{"$error":"#VALUE!"}},{"$f":"IF(AI40=\"\",\"\",RANK(AQ40:AQ42,AQ40:AQ42,0))","v":""},null,2,2,{"$f":"IF(【準備】登録!$U$6<AV39,\"\",AV36)","v":""},null,{"$f":"IF(VLOOKUP(VALUE($A41&$D39),【準備】登録!$AI$5:$AL$28,3,FALSE)=0,\"\",VLOOKUP(VALUE($A41&$D39),【準備】登録!$AI$5:$AL$28,3,FALSE))","v":""},null,{"$f":"VLOOKUP(AX41,【準備】登録!$AK$4:$AL$27,2,FALSE)","v":{"$error":"#N/A"}},{"$f":"IF(ISERROR(VLOOKUP($AX41&$AV$3&BA$4,【進行】結果入力表!$Q$7:$V$150,2,FALSE)),\"\",VLOOKUP($AX41&$AV$3&BA$4,【進行】結果入力表!$Q$7:$V$150,2,FALSE))","v":""},null,null,null,{"$f":"IF(ISERROR(VLOOKUP($AX41&$AV$3&BE$4,【進行】結果入力表!$Q$7:$V$150,2,FALSE)),\"\",VLOOKUP($AX41&$AV$3&BE$4,【進行】結果入力表!$Q$7:$V$150,2,FALSE))","v":""},null,{"$f":"IF(BE40=\"\",\"\",COUNTIF(BA41:BF41,\"w\"))","v":""},{"$f":"IF(BE40=\"\",\"\",COUNT(BA41,BE41))","v":""},{"$f":"SUM(BA41:BF41)+BG41*AZ41","v":{"$error":"#VALUE!"}},null,{"$f":"IF(BE40=\"\",\"\",BI41/AZ41*180)","v":""},{"$f":"IF(BC40=\"w\",180,BC40/AZ41*180)+IF(BC42=\"w\",180,BC42/AZ41*180)","v":{"$error":"#VALUE!"}},{"$f":"BG41*10000000+BK41*BG10040*10000000+BK41*1000-BL41","v":{"$error":"#VALUE!"}},{"$f":"IF(BE40=\"\",\"\",RANK(BM40:BM42,BM40:BM42,0))","v":""}]
[1,8,null,{"$f":"IF(【準備】登録!$U$6<D39,\"\",D37)","v":""},null,{"$f":"IF(VLOOKUP(VALUE($A42&$D39),【準備】登録!$AI$5:$AL$28,3,FALSE)=0,\"\",VLOOKUP(VALUE($A42&$D39),【準備】登録!$AI$5:$AL$28,3,FALSE))","v":""},null,{"$f":"VLOOKUP(F42,【準備】登録!$AK$4:$AL$27,2,FALSE)","v":{"$error":"#N/A"}},{"$f":"IF(ISERROR(VLOOKUP($F42&$D$3&I$4,【進行】結果入力表!$Q$7:$V$150,2,FALSE)),\"\",VLOOKUP($F42&$D$3&I$4,【進行】結果入力表!$Q$7:$V$150,2,FALSE))","v":""},null,{"$f":"IF(ISERROR(VLOOKUP($F42&$D$3&K$4,【進行】結果入力表!$Q$7:$V$150,2,FALSE)),\"\",VLOOKUP($F42&$D$3&K$4,【進行】結果入力表!$Q$7:$V$150,2,FALSE))","v":""},null,null,null,{"$f":"IF(M40=\"\",\"\",COUNTIF(I42:N42,\"w\"))","v":""},{"$f":"IF(M40=\"\",\"\",COUNT(I42,K42))","v":""},{"$f":"SUM(I42:N42)+O42*H42","v":{"$error":"#VALUE!"}},null,{"$f":"IF(M40=\"\",\"\",Q42/H42*180)","v":""},{"$f":"IF(M40=\"w\",180,M40/H42*180)+IF(M41=\"w\",180,M41/H42*180)","v":{"$error":"#VALUE!"}},{"$f":"O42*10000000+S42*O10041*10000000+S42*1000-T42","v":{"$error":"#VALUE!"}},{"$f":"IF(M40=\"\",\"\",RANK(U40:U42,U40:U42,0))","v":""},null,1,8,{"$f":"IF(【準備】登録!$U$6<Z39,\"\",Z37)","v":""},null,{"$f":"IF(VLOOKUP(VALUE($A42&$D39),【準備】登録!$AI$5:$AL$28,3,FALSE)=0,\"\",VLOOKUP(VALUE($A42&$D39),【準備】登録!$AI$5:$AL$28,3,FALSE))","v":""},null,{"$f":"VLOOKUP(AB42,【準備】登録!$AK$4:$AL$27,2,FALSE)","v":{"$error":"#N/A"}},{"$f":"IF(ISERROR(VLOOKUP($AB42&$Z$3&AE$4,【進行】結果入力表!$Q$7:$V$150,2,FALSE)),\"\",VLOOKUP($AB42&$Z$3&AE$4,【進行】結果入力表!$Q$7:$V$150,2,FALSE))","v":""},null,{"$f":"IF(ISERROR(VLOOKUP($AB42&$Z$3&AG$4,【進行】結果入力表!$Q$7:$V$150,2,FALSE)),\"\",VLOOKUP($AB42&$Z$3&AG$4,【進行】結果入力表!$Q$7:$V$150,2,FALSE))","v":""},null,null,null,{"$f":"IF(AI40=\"\",\"\",COUNTIF(AE42:AJ42,\"w\"))","v":""},{"$f":"IF(AI40=\"\",\"\",COUNT(AE42,AG42))","v":""},{"$f":"SUM(AE42:AJ42)+AK42*AD42","v":{"$error":"#VALUE!"}},null,{"$f":"IF(AI40=\"\",\"\",AM42/AD42*180)","v":""},{"$f":"IF(AI40=\"w\",180,AI40/AD42*180)+IF(AI41=\"w\",180,AI41/AD42*180)","v":{"$error":"#VALUE!"}},{"$f":"AK42*10000000+AO42*AK10041*10000000+AO42*1000-AP42","v":{"$error":"#VALUE!"}},{"$f":"IF(AI40=\"\",\"\",RANK(AQ40:AQ42,AQ40:AQ42,0))","v":""},null,1,8,{"$f":"IF(【準備】登録!$U$6<AV39,\"\",AV37)","v":""},null,{"$f":"IF(VLOOKUP(VALUE($A42&$D39),【準備】登録!$AI$5:$AL$28,3,FALSE)=0,\"\",VLOOKUP(VALUE($A42&$D39),【準備】登録!$AI$5:$AL$28,3,FALSE))","v":""},null,{"$f":"VLOOKUP(AX42,【準備】登録!$AK$4:$AL$27,2,FALSE)","v":{"$error":"#N/A"}},{"$f":"IF(ISERROR(VLOOKUP($AX42&$AV$3&BA$4,【進行】結果入力表!$Q$7:$V$150,2,FALSE)),\"\",VLOOKUP($AX42&$AV$3&BA$4,【進行】結果入力表!$Q$7:$V$150,2,FALSE))","v":""},null,{"$f":"IF(ISERROR(VLOOKUP($AX42&$AV$3&BC$4,【進行】結果入力表!$Q$7:$V$150,2,FALSE)),\"\",VLOOKUP($AX42&$AV$3&BC$4,【進行】結果入力表!$Q$7:$V$150,2,FALSE))","v":""},null,null,null,{"$f":"IF(BE40=\"\",\"\",COUNTIF(BA42:BF42,\"w\"))","v":""},{"$f":"IF(BE40=\"\",\"\",COUNT(BA42,BC42))","v":""},{"$f":"SUM(BA42:BF42)+BG42*AZ42","v":{"$error":"#VALUE!"}},null,{"$f":"IF(BE40=\"\",\"\",BI42/AZ42*180)","v":""},{"$f":"IF(BE40=\"w\",180,BE40/AZ42*180)+IF(BE41=\"w\",180,BE41/AZ42*180)","v":{"$error":"#VALUE!"}},{"$f":"BG42*10000000+BK42*BG10041*10000000+BK42*1000-BL42","v":{"$error":"#VALUE!"}},{"$f":"IF(BE40=\"\",\"\",RANK(BM40:BM42,BM40:BM42,0))","v":""}]
[null,null,null,null,"※","TPの数字は、ハンデによる換算後の得点を示す。"]

{"sheet":"【結果】総合結果表","index":5,"n_rows":34,"n_cols":37,"rows_kept":34,"cut":false,"hidden":false,"merged":[[15,1,20,3],[21,1,26,3],[27,1,32,3],[21,4,22,6],[27,4,28,6],[15,4,20,9],[21,7,22,9],[23,4,24,6],[31,4,32,6],[25,16,26,18],[25,4,26,6],[23,16,24,18],[29,7,30,9],[23,7,24,9],[27,16,32,21],[25,7,26,9],[27,7,28,9],[29,4,30,6],[31,7,32,9],[25,19,26,21],[21,10,26,15],[27,13,28,15],[23,19,24,21],[15,10,16,12],[15,13,16,15],[17,10,18,12],[21,16,22,18],[21,19,22,21],[11,4,12,9],[11,10,12,15],[11,16,12,21],[15,16,16,18],[27,22,32,25],[11,22,14,25],[21,22,26,25],[15,19,16,21],[19,16,20,18],[19,19,20,21],[31,10,32,12],[31,13,32,15],[29,10,30,12],[29,13,30,15],[27,10,28,12],[19,10,20,12],[15,22,20,25],[13,4,14,6],[13,7,14,9],[13,10,14,12],[13,13,14,15],[13,16,14,18],[13,19,14,21],[17,13,18,15],[17,16,18,18],[17,19,18,21],[19,13,20,15],[11,30,14,33],[11,36,14,39],[15,26,20,29],[15,36,20,39],[17,30,20,33],[15,30,16,33],[11,26,14,29],[21,36,26,39],[27,26,32,29],[27,36,32,39],[21,30,22,33],[23,30,26,33],[27,30,28,33],[29,30,32,33],[21,26,26,29],[0,1,1,39],[3,36,3,39],[5,1,6,4],[7,1,8,4],[5,24,6,27],[7,24,8,27],[7,5,8,12],[7,13,8,22],[7,23,8,23],[5,23,6,23],[7,28,8,31],[7,32,8,39],[5,5,6,12],[5,13,6,22],[5,28,6,31],[5,32,6,39]]}
[null,{"$f":"【結果】個人成績表!A1","v":"第9回　神奈滋対抗戦　　　(奈良；キングスポット)"}]
[]
[]
[null,null,null,null,null,null,null,null,null,null,null,null,null,null,null,null,null,null,null,null,null,null,null,null,null,null,null,null,null,null,null,null,null,null,null,null,{"$f":"【準備】登録!D4","v":"2021-03-21"}]
[]
[null,"MVP",null,null,null,"HRC(5-1)",null,null,null,null,null,null,null,"金井　健太郎",null,null,null,null,null,null,null,null,null,null,"VP",null,null,null,"SBC(5-1)",null,null,null,"林　秀忠"]
[]
[null,"HR",null,null,null,"HRC(127)",null,null,null,null,null,null,null,"中尾　亮太",null,null,null,null,null,null,null,null,null,null,"VP",null,null,null,"NRC(3-3)",null,null,null,"金澤　茂昌"]
[]
[]
[]
[null,null,null,null,{"$f":"B16","v":"SBC"},null,null,null,null,null,{"$f":"B22","v":"HRC"},null,null,null,null,null,{"$f":"B28","v":"NRC"},null,null,null,null,null,"W",null,null,null,"L",null,null,null,"TP",null,null,null,null,null,"RK"]
[null,null,null,null,null,null,null,null,null,null,null,null,null,null,null,null,null,null,null,null,null,null,null,null,null,null,null,null,null,null,null,null,null,null,"(TP)","TP"]
[null,null,null,null,"W",null,null,"L",null,null,"W",null,null,"L",null,null,"W",null,null,"L"]
[]
[null,{"$f":"IF(【準備】登録!B11=\"\",\"\",【準備】登録!B11)","v":"SBC"},null,null,null,null,null,null,null,null,{"$f":"【結果】個人成績表!H14","v":4},null,null,{"$f":"【結果】個人成績表!I14","v":2},null,null,{"$f":"【結果】個人成績表!R14-【結果】個人成績表!H14","v":3},null,null,{"$f":"【結果】個人成績表!S14-【結果】個人成績表!I14","v":3},null,null,{"$f":"IF(Q16=\"\",\"\",SUM(Q16:S21,K16:M21))","v":22},null,null,null,{"$f":"IF(T16=\"\",\"\",SUM(T16:V21,N16:P21))","v":14},null,null,null,{"$f":"IF(【結果】個人成績表!BH14=\"\",\"\",\"(\"&【結果】個人成績表!BH14&\")\")","v":"(5223)"},null,null,null,{"$f":"【結果】個人成績表!BH14","v":5223},{"$f":"【結果】個人成績表!CE14","v":5394.7142857142862},1]
[]
[null,null,null,null,null,null,null,null,null,null,{"$f":"IF(【結果】個人成績表!AL14=\"\",\"\",【結果】個人成績表!AL14-【結果】個人成績表!AB14)","v":4},null,null,{"$f":"IF(【結果】個人成績表!AM14=\"\",\"\",【結果】個人成績表!AM14-【結果】個人成績表!AC14)","v":2},null,null,{"$f":"IF(【結果】個人成績表!AB14=\"\",\"\",【結果】個人成績表!AB14-【結果】個人成績表!R14)","v":4},null,null,{"$f":"IF(【結果】個人成績表!AC14=\"\",\"\",【結果】個人成績表!AC14-【結果】個人成績表!S14)","v":2},null,null,null,null,null,null,null,null,null,null,{"$f":"IF(【結果】個人成績表!CE14=0,\"\",【結果】個人成績表!CE14)","v":5394.7142857142862}]
[]
[null,null,null,null,null,null,null,null,null,null,{"$f":"IF(【結果】個人成績表!BF14=\"\",\"\",【結果】個人成績表!BF14-【結果】個人成績表!AV14)","v":3},null,null,{"$f":"IF(【結果】個人成績表!BG14=\"\",\"\",【結果】個人成績表!BG14-【結果】個人成績表!AW14)","v":3},null,null,{"$f":"IF(【結果】個人成績表!AV14=\"\",\"\",【結果】個人成績表!AV14-【結果】個人成績表!AL14)","v":4},null,null,{"$f":"IF(【結果】個人成績表!AW14=\"\",\"\",【結果】個人成績表!AW14-【結果】個人成績表!AM14)","v":2}]
[]
[null,{"$f":"IF(【準備】登録!B12=\"\",\"\",【準備】登録!B12)","v":"HRC"},null,null,{"$f":"N16","v":2},null,null,{"$f":"K16","v":4},null,null,null,null,null,null,null,null,{"$f":"【結果】個人成績表!R24-【結果】個人成績表!H24","v":5},null,null,{"$f":"【結果】個人成績表!S24-【結果】個人成績表!I24","v":1},null,null,21,null,null,null,15,null,null,null,{"$f":"IF(【結果】個人成績表!BH24=\"\",\"\",\"(\"&【結果】個人成績表!BH24&\")\")","v":"(5362)"},null,null,null,{"$f":"【結果】個人成績表!BH24","v":5362},{"$f":"【結果】個人成績表!CE24","v":5576.8571428571431},2]
[]
[null,null,null,null,{"$f":"N18","v":2},null,null,{"$f":"K18","v":4},null,null,null,null,null,null,null,null,{"$f":"IF(【結果】個人成績表!AL24=\"\",\"\",【結果】個人成績表!AL24-【結果】個人成績表!AB24)","v":5},null,null,{"$f":"IF(【結果】個人成績表!AM24=\"\",\"\",【結果】個人成績表!AM24-【結果】個人成績表!AC24)","v":1},null,null,null,null,null,null,null,null,null,null,{"$f":"IF(【結果】個人成績表!CE24=0,\"\",【結果】個人成績表!CE24)","v":5576.8571428571431}]
[]
[null,null,null,null,{"$f":"N20","v":3},null,null,{"$f":"K20","v":3},null,null,null,null,null,null,null,null,{"$f":"IF(【結果】個人成績表!BF24=\"\",\"\",【結果】個人成績表!BF24-【結果】個人成績表!AV24)","v":5},null,null,{"$f":"IF(【結果】個人成績表!BG24=\"\",\"\",【結果】個人成績表!BG24-【結果】個人成績表!AW24)","v":1}]
[]
[null,{"$f":"IF(【準備】登録!B13=\"\",\"\",【準備】登録!B13)","v":"NRC"},null,null,{"$f":"T16","v":3},null,null,{"$f":"Q16","v":3},null,null,{"$f":"T22","v":1},null,null,{"$f":"Q22","v":5},null,null,null,null,null,null,null,null,11,null,null,null,25,null,null,null,{"$f":"IF(【結果】個人成績表!BH34=\"\",\"\",\"(\"&【結果】個人成績表!BH34&\")\")","v":"(4050)"},null,null,null,{"$f":"【結果】個人成績表!BH34","v":4050},{"$f":"【結果】個人成績表!CE34","v":4183.7142857142862},{"$f":"IF(AE30=\"\",\"\",RANK(W$16:W$33,W$16:W$33,0))","v":3}]
[]
[null,null,null,null,{"$f":"T18","v":2},null,null,{"$f":"Q18","v":4},null,null,{"$f":"T24","v":1},null,null,{"$f":"Q24","v":5},null,null,null,null,null,null,null,null,null,null,null,null,null,null,null,null,{"$f":"IF(【結果】個人成績表!CE34=0,\"\",【結果】個人成績表!CE34)","v":4183.7142857142862}]
[]
[null,null,null,null,{"$f":"T20","v":2},null,null,{"$f":"Q20","v":4},null,null,{"$f":"T26","v":1},null,null,{"$f":"Q26","v":5}]
[]
[null,null,null,"※","TPの上段（　　）内の数字は、ハンデによる換算をしていない得点を示す。"]